program: Gaussian 09
title: 000247120
version: EM64L-G09RevD.01
frameworkgroup: C1[X(C13H17ClO)]
method: RPBEPBE
basis: SDD
operation: Freq
keyword: #p
keyword: freq=noraman
keyword: PBEPBE/SDD
title: #p freq=noraman PBEPBE/SDD
converged: YES YES NO NO
title: Mulliken charges:
elementType: Cl O C C C C C C C C C C C C C H H H H H H H H H H H H H H H H H
charge: -0.070432 -0.465597 -0.028345 -0.084418 -0.443575 -0.450053 -0.404513 -0.391156 -0.632883 0.516412 -0.391164 -0.412220 -0.221245 -0.221426 -0.105773 0.230956 0.181627 0.228392 0.185408 0.184301 0.215381 0.197093 0.202237 0.193597 0.205180 0.262402 0.198130 0.335198 0.246717 0.236837 0.251435 0.251496
chargesum: 0.00000
title: Mulliken charges with hydrogens summed into heavy atoms:
elementType: Cl O C C C C C C C C C C C C C
charge: -0.070432 -0.130399 0.202611 0.097209 -0.029775 -0.050371 -0.005183 0.007621 -0.172350 0.516412 -0.144447 -0.175383 0.030189 0.030071 -0.105773
polarizability: 2.04127546e+02 1.48129496e+01 1.20793690e+02 -9.54129218e+00 1.31798213e+01 1.19767718e+02
1716.lowfreq: -12.5483 -0.0026 -0.0025 -0.0010 3.9655 10.0030 28.8382 43.7891 46.9412
frequency: 28.2961 43.5468 46.1704 102.8138 131.8575 175.1452 185.1320 243.3095 278.4570 285.7817 311.8202 334.3650 357.7220 366.9943 406.9044 410.1145 420.3983 436.9831 479.4804 531.1210 551.8313 627.0857 638.0328 713.4471 777.5791 794.8673 818.2448 829.2917 836.6055 845.0829 880.7551 898.5549 926.2181 947.6679 964.0492 965.1060 998.8951 1003.2386 1046.3450 1055.7670 1059.1549 1070.9034 1085.1901 1103.9760 1115.8831 1129.7903 1153.4911 1182.0819 1190.0432 1215.7606 1232.6652 1248.4892 1255.7603 1281.3854 1293.7363 1300.8354 1312.1397 1327.6371 1332.4297 1339.2671 1342.2393 1349.0767 1376.3945 1394.0986 1395.2022 1464.4083 1465.3821 1470.1499 1474.6933 1476.2974 1478.5800 1585.8951 1599.3012 2911.4570 2952.8339 2963.2583 2969.8508 2971.8665 2974.1270 2985.4927 3024.9995 3034.2429 3036.3360 3046.2409 3054.2071 3126.4839 3129.4742 3165.9954 3169.2005 3561.0984
redmass: 3.7834 6.3775 4.2595 3.5220 5.6997 2.7172 5.5742 3.8801 1.2583 3.4240 1.7833 2.5688 4.2255 2.3260 3.1848 3.2618 4.7344 3.4681 3.0546 2.7202 1.9991 6.8759 5.2501 3.5317 1.9189 3.1596 1.6219 1.2547 1.8160 2.1181 2.1296 1.6267 1.7818 1.3821 1.9547 1.3748 4.5194 3.9402 1.6718 1.7530 1.6626 2.6497 1.8061 1.6870 1.5357 1.7994 1.3564 1.1273 1.3863 2.5171 1.3292 1.2481 1.3090 1.3362 1.2739 1.2876 1.2045 1.3950 1.4044 1.4547 1.5137 1.5034 6.4229 1.6591 2.5985 1.0928 1.0921 1.0823 1.5764 1.1709 1.3598 7.3324 6.3355 1.0823 1.0674 1.0604 1.0752 1.0653 1.0624 1.0669 1.0996 1.0964 1.0972 1.1027 1.0991 1.0898 1.0897 1.0949 1.0960 1.0661
irintensity: 0.0231 0.1625 0.2234 1.3398 0.4276 0.8679 3.1218 1.0277 104.7723 23.1116 3.3839 8.0728 14.5790 3.8129 0.4315 0.3430 8.5514 2.9005 17.4087 1.0201 18.3556 0.1134 14.5419 4.3019 9.8586 19.6408 20.8031 0.2331 26.9095 11.5566 14.0726 4.4045 8.5940 1.6729 18.1897 0.5177 59.6066 45.6279 3.8365 7.4823 7.6545 33.3073 2.0994 5.5516 8.3483 7.0545 22.0790 0.6072 4.0920 0.7033 12.1394 2.1368 5.1034 10.2786 1.5055 4.7686 4.6051 7.2160 1.9460 0.8660 1.6743 5.1461 0.0991 1.6173 4.0670 6.3255 8.7353 17.8237 52.8633 14.9178 33.5084 1.0282 2.7594 38.9787 18.0335 35.7576 13.7671 47.2229 27.4639 51.2736 53.0023 53.7914 20.8243 90.2681 22.4649 12.0551 10.8294 8.6087 0.5688 2.9344
temp: 298.150 k
press: 1.00000 atm
elementType: 17 8 6 6 6 6 6 6 6 6 6 6 6 6 6 1 1 1 1 1 1 1 1 1 1 1 1 1 1 1 1 1
symmnumber: 1
zpe: 705046.6 jmol-1
zpe.correction: 0.268538 hartree
zpe.thermalcorrener: 0.282878 hartree
zpe.thermalcorrenthalpy: 0.283822 hartree
zpe.thermalcorrgfe: 0.226011 hartree
zpe.sumelectzpe: -1039.733718 hartree
zpe.sumelectthermal: -1039.719378 hartree
zpe.sumelectthermalent: -1039.718434 hartree
zpe.sumelectthermalfe: -1039.776244 hartree
dipole: -4.4139 0.5369 0.7346
dipole: 4.5067
quadrupole: -97.9248 -98.4311 -93.4505
quadrupole: 0.9122 -0.1641 3.3160
quadrupole: -1.3227 -1.8290 3.1516 0.9122 -0.1641 3.3160
hfenergy: -1040.0022558 hartree
pointgroup: C01 [X(C13H17Cl1O1)]
dipole: 1.7408821 -0.1481999 0.3018326 debye
polarizability: 201.5653565|18.1653763|126.4205552|14.6120436|-11.2799907|116.7030411 unknown
InChI: InChI=1S/C13H17ClO/c14-12-7-5-10(6-8-12)9-11-3-1-2-4-13(11)15/h5-8,11,13,15H,1-4,9H2
charge 0 multiplicity 1
32 atoms
Cl -5.348628 -0.737168 -0.77005
O  2.675692 2.318009 0.218098
C  1.451357 0.23174 0.074195
C  2.828754 0.855165 0.379308
C  1.54436 -1.314742 0.137274
C  3.930166 0.30668 -0.552571
C  2.645128 -1.875571 -0.792715
C  4.01779 -1.236817 -0.478101
C  0.358561 0.797656 1.031094
C  -1.053768 0.425022 0.610624
C  -1.66978 1.077569 -0.490642
C  -1.787181 -0.588017 1.27966
C  -2.971016 0.733146 -0.918642
C  -3.091758 -0.94987 0.870357
C  -3.662027 -0.281348 -0.22804
H  1.189311 0.53011 -0.963335
H  3.103424 0.624843 1.436301
H  0.562065 -1.750267 -0.125017
H  1.75899 -1.621936 1.183612
H  4.907626 0.760016 -0.285689
H  3.695684 0.621084 -1.58943
H  2.376045 -1.664584 -1.84803
H  2.70307 -2.976241 -0.689953
H  4.339107 -1.541707 0.539584
H  4.789886 -1.60421 -1.18054
H  0.47511 1.896467 1.050432
H  0.559827 0.4263 2.05592
H  3.559499 2.747417 0.34317
H  -1.128405 1.872821 -1.017262
H  -1.337952 -1.103132 2.137082
H  -3.438515 1.245117 -1.764946
H  -3.649324 -1.731254 1.39495
