program: Gaussian 09
title: 000247118
version: EM64L-G09RevD.01
frameworkgroup: C1[X(C10H22O2)]
method: RPBEPBE
basis: SDD
operation: Freq
keyword: #pfreq=noraman
keyword: PBEPBE/SDD
title: #p freq=noraman PBEPBE/SDD
converged: YES YES NO NO
title: Mulliken charges:
elementType: O O C C C C C C C C C C H H H H H H H H H H H H H H H H H H H H H H
charge: -0.511190 -0.450627 -0.107656 -0.034586 -0.352739 -0.445522 -0.381941 -0.361175 -0.376559 -0.350173 -0.705363 -0.695357 0.191339 0.187926 0.229932 0.171635 0.178879 0.223054 0.178711 0.212848 0.203465 0.190210 0.181548 0.235428 0.201575 0.194021 0.348860 0.216120 0.214865 0.203889 0.219076 0.211845 0.210389 0.367273
chargesum: 0.00000
title: Mulliken charges with hydrogens summed into heavy atoms:
elementType: O O C C C C C C C C C C
charge: -0.162329 -0.083354 0.083683 0.153341 0.048828 -0.043589 0.009618 0.032500 0.040416 0.045423 -0.070490 -0.054047
polarizability: 1.36199708e+02 -1.09100642e+00 1.09799145e+02 7.27295798e-01 -2.58682090e+00 1.02089224e+02
1716.lowfreq: -12.1498 -8.7710 0.0001 0.0005 0.0007 11.9086 20.2229 44.8092 56.2899
frequency: 13.2448 44.7437 56.1679 68.6506 80.8266 103.1024 129.6625 157.1324 180.0532 226.8524 235.2826 237.1280 251.5146 277.9605 298.7785 308.8141 320.0992 361.4544 455.4353 488.5257 536.6125 615.2695 672.4427 726.9841 744.9595 755.7012 805.6370 857.0701 880.4687 890.7824 905.3391 925.2603 949.5682 982.3097 1002.6510 1036.4075 1049.4404 1063.6767 1078.5632 1080.2223 1087.9707 1114.3547 1126.6122 1155.2501 1177.8351 1199.1716 1210.9497 1224.8902 1250.6572 1263.2534 1270.0828 1283.2507 1293.1928 1302.2028 1309.6015 1323.5330 1339.6922 1354.0243 1356.8133 1362.0201 1385.9500 1388.9654 1389.8270 1423.6381 1456.2647 1458.5806 1466.2577 1471.9848 1475.6547 1477.3774 1477.8068 1484.6519 1486.5981 1492.1543 2932.7789 2936.6207 2948.4452 2957.3016 2957.9243 2964.0123 2968.5406 2970.1814 2973.0713 2973.2066 3000.5760 3019.4794 3022.7137 3040.5973 3045.8041 3058.3335 3069.0272 3069.1612 3070.7977 3073.9119 3415.4136 3577.0173
redmass: 3.1163 2.7943 1.7557 2.8608 2.0886 2.8312 3.1737 2.3419 3.0228 1.1742 1.4369 1.7612 2.9556 1.5557 2.2432 2.4180 3.4105 3.2155 3.6841 2.8881 2.3168 1.2114 1.8222 1.1806 1.4273 1.5615 1.4502 1.9116 1.7195 1.8699 1.9070 1.8667 1.5087 2.6448 2.5989 2.5901 2.5787 1.6546 2.2831 2.0436 1.8033 2.1305 1.8984 2.0380 1.1803 1.2705 1.3861 1.4864 1.2579 1.2184 1.2202 1.2215 1.0790 1.2178 1.2009 1.4206 1.4322 1.5705 1.4644 1.4240 1.5329 1.2171 1.2271 1.1886 1.0795 1.0801 1.0706 1.0643 1.0614 1.0449 1.0481 1.0673 1.0807 1.0839 1.0713 1.0828 1.0661 1.0653 1.0608 1.0648 1.0612 1.0387 1.0370 1.0769 1.0950 1.0978 1.0922 1.1013 1.0987 1.0905 1.1002 1.1006 1.0999 1.0992 1.0652 1.0663
irintensity: 1.1777 0.1124 0.6698 1.9233 0.8521 0.5536 0.6027 1.4002 3.3014 0.0838 0.9246 0.1654 15.1386 80.6815 33.8555 2.8365 3.3939 2.5452 4.9639 4.3924 4.4363 131.6724 31.7995 11.9492 7.3099 11.8811 2.3018 5.0608 6.1130 6.3068 6.7439 14.3089 15.6359 78.8465 4.3512 2.5974 14.9698 21.9797 0.3836 0.2946 10.5754 34.1888 8.8091 3.9405 52.6926 13.4393 1.5674 0.4301 4.6852 4.9060 0.6079 5.5246 0.6744 0.6356 1.6963 0.3699 14.7331 1.3223 2.7859 1.9087 17.2981 11.1479 8.4231 94.4550 2.7200 3.1879 0.5768 4.8642 6.0347 12.8483 8.5779 14.0773 11.3829 12.3185 79.3077 46.2110 27.0547 25.0763 7.4715 58.5933 72.4069 29.6016 23.9551 61.6832 6.5450 2.5074 3.6542 65.9515 11.4535 46.2072 40.2552 128.2435 61.3100 50.9411 102.2273 5.0428
temp: 298.150 k
press: 1.00000 atm
elementType: 8 8 6 6 6 6 6 6 6 6 6 6 1 1 1 1 1 1 1 1 1 1 1 1 1 1 1 1 1 1 1 1 1 1
symmnumber: 1
zpe: 802938.2 jmol-1
zpe.correction: 0.305823 hartree
zpe.thermalcorrener: 0.321731 hartree
zpe.thermalcorrenthalpy: 0.322676 hartree
zpe.thermalcorrgfe: 0.260940 hartree
zpe.sumelectzpe: -543.670536 hartree
zpe.sumelectthermal: -543.654627 hartree
zpe.sumelectthermalent: -543.653683 hartree
zpe.sumelectthermalfe: -543.715418 hartree
dipole: -3.7149 -1.3096 -2.1328
dipole: 4.4793
quadrupole: -81.7439 -79.0256 -76.5850
quadrupole: -6.9961 -1.4703 -6.9498
quadrupole: -2.6257 0.0926 2.5331 -6.9961 -1.4703 -6.9498
hfenergy: -543.9763588 hartree
pointgroup: C01 [X(C10H22O2)]
dipole: 1.4251624 0.3929751 -0.9592382 debye
polarizability: 136.2058373|-0.2706538|110.4430433|-1.392807|0.897584|101.4391958 unknown
InChI: InChI=1S/C10H22O2/c1-3-5-7-10(12)9(8-11)6-4-2/h9-12H,3-8H2,1-2H3
charge 0 multiplicity 1
34 atoms
O  -0.357608 -2.147326 -0.721477
O  -1.763036 -1.746747 1.56895
C  -0.72924 0.078525 0.184196
C  0.227267 -0.771929 -0.693701
C  -2.072155 0.323856 -0.55569
C  1.697939 -0.840583 -0.226585
C  -0.931676 -0.541888 1.593255
C  2.443333 0.51338 -0.282601
C  -3.061451 1.233555 0.205401
C  3.95879 0.371163 -0.01215
C  -4.307074 1.576424 -0.640268
C  4.701689 1.72394 -0.036783
H  -0.235674 1.063247 0.329185
H  0.204845 -0.364334 -1.72962
H  -2.556541 -0.649941 -0.757804
H  -1.847912 0.780558 -1.543607
H  2.235807 -1.560922 -0.882035
H  1.744607 -1.25692 0.798442
H  0.056712 -0.756244 2.057876
H  -1.457058 0.171489 2.250705
H  2.010281 1.213988 0.459094
H  2.293549 0.981282 -1.278742
H  -2.549779 2.171028 0.509321
H  -3.381373 0.725953 1.134972
H  4.108741 -0.117674 0.971934
H  4.401718 -0.309413 -0.767898
H  0.244939 -2.754941 -1.217337
H  -4.845789 0.656266 -0.935106
H  -5.013718 2.216235 -0.080138
H  -4.025685 2.112121 -1.567159
H  5.782212 1.595027 0.157014
H  4.300657 2.411294 0.731787
H  4.591671 2.219937 -1.019797
H  -1.419485 -2.291205 0.804667
