program: Gaussian 09
title: 000247121
version: EM64L-G09RevD.01
frameworkgroup: C1[X(C15H10Cl4O3)]
method: RPBEPBE
basis: SDD
operation: Freq
keyword: #p
keyword: freq=noraman
keyword: PBEPBE/SDD
title: #p freq=noraman PBEPBE/SDD
converged: YES YES NO NO
title: Mulliken charges:
elementType: Cl Cl Cl Cl O O O C C C C C C C C C C C C C C C H H H H H H H H H H
charge: -0.007431 -0.007474 0.000450 0.000398 -0.220834 -0.220761 -0.298999 0.493958 0.493306 -0.499558 -0.499530 -0.329867 -0.329092 -0.384026 -0.384046 -0.074997 -0.075320 -0.196932 -0.196973 -0.102463 -0.102515 0.355415 0.234862 0.250780 0.234884 0.250712 0.298735 0.298955 0.247318 0.247298 0.261885 0.261866
chargesum: 0.00000
title: Mulliken charges with hydrogens summed into heavy atoms:
elementType: Cl Cl Cl Cl O O O C C C C C C C C C C C C C C C
charge: -0.007431 -0.007474 0.000450 0.000398 -0.220834 -0.220761 -0.298999 0.493958 0.493306 -0.013917 -0.013934 -0.031132 -0.030137 -0.136709 -0.136748 -0.074997 -0.075320 0.064954 0.064893 -0.102463 -0.102515 0.355415
polarizability: 2.97862732e+02 6.62609312e-03 1.96734585e+02 -2.94972078e+01 3.10632557e-02 1.38854028e+02
1716.lowfreq: -9.5566 -5.4718 -4.3970 -0.0017 -0.0003 0.0009 8.0631 11.6498 18.4643
frequency: 7.9213 11.5760 18.4481 26.5568 31.2053 84.6047 88.0347 93.5835 139.8497 149.8016 167.9029 183.1342 184.2330 205.4637 227.0787 234.1071 273.7601 305.0158 325.1903 331.2462 357.4963 393.8406 432.1287 432.5956 435.4232 439.2312 443.2686 454.2822 501.2339 571.2503 598.7475 622.8559 641.9673 648.8227 673.7468 673.9885 694.1357 715.2888 717.8032 809.7793 810.4994 827.6799 846.2982 858.3626 869.0515 908.0166 909.2900 955.5660 956.2368 978.4116 985.7586 1005.6571 1006.2904 1014.8875 1119.3375 1119.7351 1146.0606 1146.3183 1175.7253 1217.2773 1218.0827 1233.6384 1239.6712 1261.0424 1261.5590 1344.4546 1360.2286 1372.7006 1372.7116 1386.7055 1386.8555 1459.5321 1459.9055 1462.6188 1465.4021 1570.6025 1570.7524 1595.6287 1595.9070 1608.3218 3045.9459 3046.0124 3123.7182 3123.8365 3145.5437 3145.5534 3167.2988 3167.4776 3174.7825 3174.8186
redmass: 12.1622 11.2467 11.2145 8.2188 11.7707 9.7547 15.3449 8.4774 9.8254 6.1802 6.3415 23.4134 28.1860 7.8084 8.6489 11.7322 3.9087 5.0975 5.0053 8.5639 5.7508 4.5392 5.9682 4.1139 4.8157 3.9879 3.4632 4.8347 5.1553 5.7756 5.5623 6.6582 6.2543 5.8900 6.8942 6.5658 8.3952 4.3401 3.4130 1.9866 3.9221 1.6504 2.3552 3.8507 6.0943 1.5645 1.5816 1.3784 1.3693 2.6802 1.7641 5.3335 5.2534 3.7034 2.1503 2.1527 1.4381 1.4340 6.4381 2.2019 2.1925 1.1550 1.2100 1.5570 1.5484 1.2255 1.3127 8.2661 8.4115 2.5781 2.5833 1.8959 2.4020 1.4194 1.1880 7.5866 7.5786 6.6841 6.6097 8.3069 1.0596 1.0596 1.1073 1.1074 1.0899 1.0899 1.0930 1.0930 1.0963 1.0963
irintensity: 0.2345 0.2814 0.0034 0.2888 0.0534 0.9314 2.3404 0.0252 1.9235 0.5942 0.0170 0.2099 0.0327 7.5304 1.9226 0.2493 3.5280 0.0206 26.2951 7.2133 0.4471 4.3580 14.2019 33.6885 1.6207 1.1451 0.7035 26.0191 0.0543 19.5005 0.4759 0.1695 9.5066 3.5470 11.4638 15.7890 13.6467 30.1219 0.0082 179.1421 37.1539 7.9534 37.1906 23.3435 203.4857 4.7905 13.0974 0.3629 0.7159 1.4001 4.0501 72.0060 11.6297 0.6125 57.8493 15.8869 5.9135 5.1646 1214.5964 27.5581 47.2273 17.4547 0.1186 4.7449 7.1963 2.4752 34.6001 0.9722 0.5972 5.7185 44.0970 2.9062 84.6015 31.0857 31.9414 28.4584 3.8556 6.9010 19.3016 119.6724 44.4101 2.5154 3.7331 4.9684 4.7531 5.3353 3.4037 0.1932 3.1359 3.5951
temp: 298.150 k
press: 1.00000 atm
elementType: 17 17 17 17 8 8 8 6 6 6 6 6 6 6 6 6 6 6 6 6 6 6 1 1 1 1 1 1 1 1 1 1
symmnumber: 1
zpe: 560715.8 jmol-1
zpe.correction: 0.213565 hartree
zpe.thermalcorrener: 0.234421 hartree
zpe.thermalcorrenthalpy: 0.235365 hartree
zpe.thermalcorrgfe: 0.157424 hartree
zpe.sumelectzpe: -2641.927860 hartree
zpe.sumelectthermal: -2641.907004 hartree
zpe.sumelectthermalent: -2641.906060 hartree
zpe.sumelectthermalfe: -2641.984002 hartree
dipole: -0.0037 -3.2618 0.0002
dipole: 3.2618
quadrupole: -169.0516 -153.5308 -145.3087
quadrupole: -0.0273 15.8361 0.0068
quadrupole: -13.0879 2.4329 10.6550 -0.0273 15.8361 0.0068
hfenergy: -2642.1414252 hartree
pointgroup: C01 [X(C15H10Cl4O3)]
dipole: -0.0009372 1.2833064 -0.0013337 debye
polarizability: 276.3650672|0.0014659|196.7345955|61.8567033|-0.0210459|160.3516826 unknown
InChI: InChI=1S/C15H10Cl4O3/c16-11-3-1-9(5-13(11)18)7-21-15(20)22-8-10-2-4-12(17)14(19)6-10/h1-6H,7-8H2
charge 0 multiplicity 1
32 atoms
Cl -4.38667 -3.161475 -1.924811
Cl 4.381699 -3.163906 1.925793
Cl -6.823035 -0.966851 -2.186485
Cl 6.8191 -0.971003 2.192243
O  -0.883727 0.905194 0.674953
O  0.886086 0.905338 -0.677462
O  0.003701 -1.166179 0.001681
C  -3.161375 -0.111266 0.532994
C  3.162643 -0.112091 -0.533088
C  -1.974155 0.176102 1.423484
C  1.976964 0.176215 -1.425209
C  -3.231345 -1.327645 -0.191176
C  3.230535 -1.328715 0.19082
C  -4.217256 0.826718 0.414469
C  4.218858 0.825239 -0.412407
C  -4.338447 -1.594135 -1.019931
C  4.336047 -1.596228 1.021371
C  -5.324477 0.559713 -0.416122
C  5.324502 0.557199 0.41994
C  -5.385739 -0.653547 -1.133701
C  5.383773 -0.656376 1.137181
C  0.002057 0.089489 -0.000201
H  -2.22491 0.888189 2.223907
H  -1.540864 -0.746471 1.844887
H  2.228988 0.888205 -2.22534
H  1.543712 -0.746173 -1.847036
H  -2.416189 -2.054182 -0.120799
H  2.415035 -2.054737 0.118776
H  -4.174776 1.771761 0.966664
H  4.17785 1.770535 -0.964278
H  -6.142573 1.279277 -0.510553
H  6.142891 1.276205 0.516037
