program: Gaussian 09
title: 000247109
version: EM64L-G09RevD.01
frameworkgroup: C1[X(C14H11Cl2NS)]
method: RPBEPBE
basis: SDD
operation: Freq
keyword: #p
keyword: freq=noraman
keyword: PBEPBE/SDD
title: #p freq=noraman PBEPBE/SDD
converged: YES YES NO NO
title: Mulliken charges:
elementType: Cl Cl S N C C C C C C C C C C C C C C H H H H H H H H H H H
charge: -0.044664 -0.058487 0.230362 -0.256139 0.559097 0.505741 -0.441135 -0.374690 -0.330911 -0.249926 -0.325717 -0.608615 -0.258045 -0.272241 -0.154007 -0.261741 -0.274555 -0.246737 0.271231 0.272093 0.267030 0.242626 0.289240 0.290859 0.250463 0.246698 0.232647 0.262726 0.236798
chargesum: 0.00000
title: Mulliken charges with hydrogens summed into heavy atoms:
elementType: Cl Cl S N C C C C C C C C C C C C C C
charge: -0.044664 -0.058487 0.230362 -0.256139 0.559097 0.505741 0.102189 -0.374690 -0.330911 0.017103 -0.083091 -0.028515 -0.007582 -0.025542 -0.154007 -0.029094 -0.011828 -0.009939
polarizability: 2.96255501e+02 3.86061814e+00 2.19252890e+02 -5.74969329e+00 2.02734939e+00 8.64869905e+01
1716.lowfreq: -5.0230 -1.3711 0.0003 0.0020 0.0021 5.6110 30.0095 32.1968 61.0216
frequency: 29.9706 32.1378 61.0033 77.7043 118.0940 149.5588 186.6230 196.2930 215.5102 231.3972 276.6622 279.9820 316.7381 355.1547 376.0893 392.4576 420.2491 438.5814 448.4693 473.4309 515.2104 537.2019 573.1968 604.7017 612.6065 661.9619 686.2557 705.4297 711.6299 719.7826 750.3314 772.9739 794.2517 799.6569 837.6059 844.0411 892.8723 927.6660 930.3473 972.1359 1011.6286 1015.2400 1029.0432 1036.3604 1054.1878 1093.0144 1102.6666 1128.9917 1144.7031 1167.7572 1181.5988 1239.4060 1247.7481 1267.4177 1281.4657 1288.1521 1335.4078 1362.4796 1369.1701 1382.1547 1400.5986 1429.0047 1461.6057 1473.6665 1485.0924 1501.3373 1558.5518 1582.7275 1584.4393 1610.8830 3028.9914 3077.5992 3084.5506 3137.4287 3145.6655 3147.8429 3154.3562 3167.6320 3180.4013 3184.9980 3195.9962
redmass: 12.2751 10.6718 5.6651 5.9166 4.6980 8.8442 4.8332 6.1626 4.3549 5.2646 8.0730 7.5662 6.1731 5.9400 5.1047 4.1838 5.0804 4.7220 3.1311 4.6391 8.2691 4.0150 5.3478 5.9207 6.6673 6.4923 6.1263 4.2960 4.7783 3.2868 1.3590 4.4715 1.2512 1.3342 1.5053 1.3865 3.6842 1.3713 1.3477 1.3165 5.3710 2.1453 3.3299 5.5809 2.2009 4.0063 1.9830 1.5714 1.4106 1.4066 1.0879 2.2562 1.5894 1.2813 1.3325 1.4426 1.7895 1.3753 5.7835 7.2955 3.5562 2.3114 2.6820 1.4877 1.6038 1.0818 6.3647 6.8451 7.2561 7.5383 1.0609 1.0572 1.1036 1.0858 1.0908 1.0901 1.1106 1.0950 1.0974 1.0960 1.0910
irintensity: 0.8642 0.4195 0.0554 0.7141 0.2156 0.5573 1.0592 0.4499 6.4926 4.2746 0.0611 2.2593 1.8363 2.3216 2.5397 4.4014 0.7219 2.7450 0.3057 14.4857 16.6110 1.7551 6.0281 4.3631 29.2461 4.4794 2.4389 15.0735 19.5676 6.2531 91.5027 2.3901 28.3678 36.9493 29.8909 1.2151 70.7527 1.8843 0.1557 0.0016 9.5828 14.1406 30.9443 3.1925 10.9881 10.7459 42.9588 21.9805 11.2134 33.3759 0.6143 71.6377 25.2297 3.4906 19.1327 5.3349 56.9833 8.2753 6.6149 9.6555 59.3200 12.8614 394.2592 30.3000 12.3971 28.0586 40.7697 4.6435 66.0111 51.3295 12.9807 13.5009 5.8036 0.3942 8.9268 3.1661 9.1762 24.7312 13.8136 1.3425 2.3940
temp: 298.150 k
press: 1.00000 atm
elementType: 17 17 16 7 6 6 6 6 6 6 6 6 6 6 6 6 6 6 1 1 1 1 1 1 1 1 1 1 1
symmnumber: 1
zpe: 557806.3 jmol-1
zpe.correction: 0.212457 hartree
zpe.thermalcorrener: 0.228127 hartree
zpe.thermalcorrenthalpy: 0.229072 hartree
zpe.thermalcorrgfe: 0.167657 hartree
zpe.sumelectzpe: -1911.754210 hartree
zpe.sumelectthermal: -1911.738540 hartree
zpe.sumelectthermalent: -1911.737596 hartree
zpe.sumelectthermalfe: -1911.799010 hartree
dipole: 2.3357 -0.7796 -0.5704
dipole: 2.5276
quadrupole: -123.2631 -127.3284 -130.6442
quadrupole: 5.1573 -2.4842 0.6996
quadrupole: 3.8154 -0.2498 -3.5657 5.1573 -2.4842 0.6996
hfenergy: -1911.9666673 hartree
pointgroup: C01 [X(C14H11Cl2N1S1)]
dipole: 0.8855352 0.4064237 0.198845 debye
polarizability: 296.3388662|4.4367918|219.3548502|1.1564423|0.0288127|86.3016645 unknown
InChI: InChI=1S/C14H11Cl2NS/c15-7-8-17-11-3-1-2-4-13(11)18-14-6-5-10(16)9-12(14)17/h1-6,9H,7-8H2
charge 0 multiplicity 1
29 atoms
Cl -0.156128 -4.706551 -0.116989
Cl -4.949398 -0.575204 0.391773
S  0.568879 2.551285 -0.652774
N  0.234096 -0.57191 -0.445158
C  -0.951751 0.191521 -0.223753
C  1.547086 -0.069904 -0.159146
C  0.093197 -2.006012 -0.775301
C  -0.935923 1.617133 -0.198364
C  1.826943 1.325717 -0.132386
C  -2.207716 -0.451739 -0.031878
C  2.6326 -0.954807 0.096274
C  -0.034272 -2.9161 0.467024
C  -2.107668 2.35477 0.057635
C  3.111351 1.810944 0.18262
C  -3.36957 0.312373 0.176622
C  3.929584 -0.469183 0.369474
C  -3.354228 1.713548 0.241322
C  4.177325 0.917087 0.428648
H  -0.791193 -2.140857 -1.421292
H  0.96642 -2.320969 -1.371296
H  -2.300558 -1.538027 -0.048321
H  2.484248 -2.036705 0.078286
H  0.843851 -2.873518 1.125605
H  -0.945049 -2.729563 1.052018
H  -2.053822 3.447853 0.089421
H  3.279018 2.892933 0.212017
H  4.739426 -1.184624 0.546673
H  -4.26664 2.287255 0.418577
H  5.176598 1.301154 0.654771
