program: Gaussian 09
title: 000247099
version: EM64L-G09RevD.01
frameworkgroup: C1[X(C4H4BrNOS2)]
method: RPBEPBE
basis: SDD
operation: Freq
keyword: #p
keyword: freq=noraman
keyword: PBEPBE/SDD
title: #p freq=noraman PBEPBE/SDD
converged: NO YES NO NO
title: Mulliken charges:
elementType: Br S S O N C C C C H H H H
charge: 0.089280 0.382844 0.163085 -0.174946 -0.047621 -0.842312 0.371803 -0.509272 -0.598972 0.369797 0.265984 0.267197 0.263133
chargesum: 0.00000
title: Mulliken charges with hydrogens summed into heavy atoms:
elementType: Br S S O N C C C C
charge: 0.089280 0.382844 0.163085 -0.174946 -0.047621 -0.472516 0.371803 -0.509272 0.197342
polarizability: 1.60540456e+02 1.46931641e+01 9.65235367e+01 8.76845211e+00 9.93110698e-01 6.27145435e+01
1716.lowfreq: -8.7830 -5.8024 -2.6835 0.0026 0.0027 0.0029 42.2021 89.4841 109.3282
frequency: 42.1896 89.4806 109.3229 147.0309 191.3994 241.7421 244.2388 323.8037 395.2412 440.0319 487.8561 508.7397 540.1989 626.9270 707.1429 721.6215 827.1204 952.3524 1067.1367 1117.1856 1126.4879 1142.0947 1179.9597 1276.1291 1313.4338 1434.9044 1465.5734 1474.8916 1642.9606 3011.3762 3110.1878 3132.9124 3134.5467
redmass: 17.6975 5.5380 1.0223 15.1547 28.8035 6.2697 6.0588 4.1745 17.5796 8.6165 8.9131 17.4521 9.6364 6.0110 5.7550 8.2440 4.7518 4.7958 8.4487 2.0982 1.3172 1.1323 1.2647 4.4123 5.9655 1.2440 1.0430 1.0630 11.2909 1.0321 1.1026 1.1027 1.0878
irintensity: 0.0700 4.7917 0.0157 1.4663 1.8059 3.1619 2.1408 2.9916 11.1743 11.4241 72.3202 5.3518 0.3162 27.1548 24.4415 52.9539 12.6979 32.1775 4.1899 135.6064 0.2624 47.8346 16.8503 252.0216 125.8777 74.5114 21.4933 44.9295 236.0312 11.2578 8.9923 0.1361 2.4541
temp: 298.150 k
press: 1.00000 atm
elementType: 35 16 16 8 7 6 6 6 6 1 1 1 1
symmnumber: 1
zpe: 204718.3 jmol-1
zpe.correction: 0.077973 hartree
zpe.thermalcorrener: 0.087601 hartree
zpe.thermalcorrenthalpy: 0.088545 hartree
zpe.thermalcorrgfe: 0.040689 hartree
zpe.sumelectzpe: -1093.717119 hartree
zpe.sumelectthermal: -1093.707491 hartree
zpe.sumelectthermalent: -1093.706547 hartree
zpe.sumelectthermalfe: -1093.754402 hartree
dipole: -0.7809 0.8371 0.6267
dipole: 1.3051
quadrupole: -79.8380 -81.2188 -73.4736
quadrupole: -9.3919 0.8102 -3.4044
quadrupole: -1.6612 -3.0420 4.7032 -9.3919 0.8102 -3.4044
hfenergy: -1093.7950918 hartree
pointgroup: C01 [X(C4H4Br1N1O1S2)]
dipole: 0.2126611 0.3642405 -0.2928074 debye
dipolederiv: -0.5653136 -0.0755954 0.1946676 -0.1040398 -0.0896275 0.0418049 0.493719 0.0399223 -0.2782517 -0.6284583 -0.2288273 0.0038799 -0.0893541 -0.1389792 -0.0800085 -0.1823385 -0.1251895 0.0218029 -0.89181 0.0598723 -0.1104146 0.0097435 -0.2079876 -0.0005594 -0.1837997 -0.0093476 -0.0962617 -0.7316178 0.2493689 -0.1071104 0.4724464 -0.9016411 0.1666545 -0.0783866 0.0353767 -0.3112188 -1.3158132 0.5745211 -0.1945485 0.1923933 -1.0220317 -0.0312165 -0.2600102 -0.0243317 -0.1134333 0.8533263 -0.1998785 -0.4292635 -0.2757254 -0.1779364 -0.0026735 -0.6372994 -0.078136 0.4323899 1.4565417 -0.4080247 0.2533679 -0.2770561 0.9417132 -0.249949 0.3100066 -0.093462 0.180003 1.5865451 -0.1001739 0.3212907 -0.1043727 1.0354288 0.0645418 0.4655956 0.1855242 -0.1269913 0.1429238 0.1381798 0.001688 0.1333928 0.2795669 0.0271465 -0.0138643 0.0420087 0.1946937 -0.03528 -0.0067176 0.0523399 0.0230841 0.0789363 0.0518376 0.0718692 0.0066676 -0.0089936 0.0545424 -0.0535682 -0.0560506 -0.0012708 0.0703277 0.0576375 -0.0423148 -0.005261 -0.0409026 0.073409 0.1276179 -0.0039452 0.0108312 0.0520838 -0.0112052 -0.0103683 0.0201856 0.1339851 0.0010048 -0.0767744 0.0740989 0.0099275 0.0801468 -0.0340106 0.0671914 0.0060428 0.0131784 unknown
polarizability: 164.0341793|-3.7417787|93.527917|-5.3385253|-0.2204851|62.2164403 unknown
InChI: InChI=1S/C4H4BrNOS2/c1-6-3(7)2(5)9-4(6)8/h2H,1H3
charge 0 multiplicity 1
13 atoms
Br -2.621798 -1.069979 1.025469
S  0.095411 -1.871098 -0.579678
S  2.896476 -0.855904 0.253418
O  -1.414964 1.787081 -0.402164
N  0.621984 0.67143 0.018891
C  -1.337058 -0.678578 -0.507401
C  -0.758777 0.726769 -0.305023
C  1.276223 -0.561198 -0.05289
C  1.350313 1.908059 0.367473
H  -1.959837 -0.735161 -1.409216
H  1.762711 1.823823 1.386145
H  0.631704 2.74006 0.31028
H  2.181013 2.067197 -0.339204
