program: Gaussian 09
title: 000247105
version: EM64L-G09RevD.01
frameworkgroup: C1[X(C18H12ClNO2)]
method: RPBEPBE
basis: SDD
operation: Freq
keyword: #p
keyword: freq=noraman
keyword: PBEPBE/SDD
title: #p freq=noraman PBEPBE/SDD
converged: YES YES NO NO
title: Mulliken charges:
elementType: Cl O O N C C C C C C C C C C C C C C C C C C H H H H H H H H H H H H
charge: -0.044799 -0.278208 -0.225987 -0.299348 0.274059 0.153895 0.301335 0.394510 -0.539361 0.431131 0.167773 -0.587589 -0.295861 0.257339 -0.423308 -0.419334 -0.350695 -0.247348 -0.219908 -0.240828 -0.237833 -0.725503 0.286899 0.268633 0.292638 0.252505 0.246556 0.260968 0.234640 0.235934 0.232841 0.231999 0.311051 0.301205
chargesum: 0.00000
title: Mulliken charges with hydrogens summed into heavy atoms:
elementType: Cl O O N C C C C C C C C C C C C C C C C C C
charge: -0.044799 -0.278208 -0.225987 -0.299348 0.274059 0.153895 0.301335 0.394510 -0.252462 0.431131 0.167773 -0.318956 -0.003223 0.257339 -0.170803 -0.172778 -0.089727 -0.012708 0.016026 -0.007987 -0.005834 -0.113247
polarizability: 3.56415756e+02 -6.52648530e-01 2.36499504e+02 2.04005236e-01 -2.16636910e+01 1.10689362e+02
1716.lowfreq: -8.1797 -5.1965 -0.0019 -0.0012 -0.0008 3.5054 32.8201 44.2708 64.5386
frequency: 32.7760 44.2291 64.5288 77.5634 94.0299 128.6282 144.3347 177.5302 189.7737 233.4915 281.6517 287.2144 303.5795 331.6675 355.1823 367.2546 401.9978 430.5183 457.1701 481.9761 487.2580 511.6195 529.9515 543.8638 556.5768 571.0866 591.8242 617.9700 629.1521 670.7923 677.4762 701.3781 726.0782 747.0910 758.9140 761.8578 766.2192 775.3059 816.0955 853.1087 855.8587 877.1861 895.4120 906.2717 917.9273 931.4116 935.9660 949.8002 967.8583 978.7657 993.2051 1023.6443 1033.5192 1083.1240 1098.3500 1114.6770 1147.4788 1168.7436 1173.7861 1180.5110 1191.0880 1224.5911 1238.5780 1257.7521 1271.4436 1276.0226 1283.3528 1306.3238 1339.0838 1385.6741 1411.9202 1425.9030 1430.9419 1438.7880 1447.8750 1464.4991 1479.0669 1511.9463 1573.3387 1585.5457 1593.8596 1602.5091 1619.1886 1646.5014 3080.2145 3125.9155 3131.8064 3143.5352 3144.0077 3147.3353 3158.9554 3161.2387 3165.6196 3170.1255 3176.7759 3214.7212
redmass: 12.4848 6.1109 5.7181 7.1967 5.6469 5.8563 5.3119 8.3169 5.4098 5.9208 5.2706 5.5927 5.5311 6.1231 3.8462 4.9332 5.6716 3.8599 3.8759 3.2917 4.0213 6.4539 5.0258 4.2172 4.8978 5.8678 7.3457 6.6181 6.6017 5.5629 5.7734 4.8597 6.2540 6.1691 1.3930 1.3014 3.7031 2.9264 6.3516 1.3708 1.3152 3.6235 1.5755 2.6015 2.0238 2.2987 1.4641 3.8372 1.4106 1.3111 1.3388 2.2702 2.0520 2.4141 2.7754 1.4452 1.7229 1.2108 1.0948 1.7617 1.6498 2.4881 1.4586 1.2292 2.0295 1.9217 3.3726 3.2018 2.0416 9.5225 6.1141 3.6702 1.1152 2.6648 2.7897 3.2435 3.0604 4.0567 7.5635 8.6806 7.5775 7.0624 6.7182 7.5149 1.0561 1.0857 1.0892 1.0866 1.0925 1.0953 1.0924 1.0925 1.1004 1.1116 1.0985 1.0946
irintensity: 2.1670 1.0111 0.4348 0.4801 0.8241 1.6215 0.0717 4.4861 1.2437 3.1295 0.4921 2.1207 0.5776 1.5207 7.9686 2.4568 1.2772 1.9701 4.4057 14.2795 6.4714 1.2211 5.0591 6.7995 8.1264 4.7267 30.0568 1.9235 3.0976 14.7828 3.5251 0.7607 4.7450 18.7563 127.1467 10.5424 11.0929 1.9502 10.7730 1.6505 5.8730 29.8100 45.6984 1.7266 14.1479 7.1643 3.2054 11.6008 12.8172 0.1536 0.0156 4.7292 15.2192 9.9393 34.5026 57.5842 31.9756 6.8337 1.6168 52.5305 1.3592 44.7918 2.7650 27.9405 131.2348 59.8544 179.7661 140.3065 9.7692 1.3857 4.3996 8.0029 33.4313 79.0719 6.7313 263.7638 32.2130 57.6044 153.9513 157.7727 20.2343 3.8636 0.5113 11.9763 6.3108 1.8888 0.4461 3.3344 5.2626 21.9583 5.0113 18.0737 33.7384 2.1427 12.1653 1.4558
temp: 298.150 k
press: 1.00000 atm
elementType: 17 8 8 7 6 6 6 6 6 6 6 6 6 6 6 6 6 6 6 6 6 6 1 1 1 1 1 1 1 1 1 1 1 1
symmnumber: 1
zpe: 659371.2 jmol-1
zpe.correction: 0.251141 hartree
zpe.thermalcorrener: 0.268169 hartree
zpe.thermalcorrenthalpy: 0.269113 hartree
zpe.thermalcorrgfe: 0.205594 hartree
zpe.sumelectzpe: -1356.883863 hartree
zpe.sumelectthermal: -1356.866835 hartree
zpe.sumelectthermalent: -1356.865891 hartree
zpe.sumelectthermalfe: -1356.929410 hartree
dipole: -1.9917 -2.9594 0.1905
dipole: 3.5723
quadrupole: -117.9933 -135.4080 -134.0047
quadrupole: -6.7847 -3.0735 -0.7003
quadrupole: 11.1421 -6.2727 -4.8694 -6.7847 -3.0735 -0.7003
hfenergy: -1357.1350042 hartree
pointgroup: C01 [X(C18H12Cl1N1O2)]
dipole: -0.8649409 -1.1065376 0.0523408 debye
polarizability: 355.6305048|-9.4236322|238.3747471|-4.4215738|-17.7707516|109.5993695 unknown
InChI: InChI=1S/C18H12ClNO2/c19-11-18(21)20-14-7-3-4-8-16(14)22-17-10-13-6-2-1-5-12(13)9-15(17)20/h1-10H,11H2
charge 0 multiplicity 1
34 atoms
Cl -0.157225 4.231809 0.154118
O  0.988236 -1.910462 0.92423
O  2.798983 2.577278 0.480761
N  1.326342 0.774521 0.17536
C  -0.005453 0.214502 0.149431
C  -0.154579 -1.151232 0.576718
C  2.390436 -0.166251 -0.124932
C  -2.435729 0.318527 -0.220614
C  -1.132199 0.908084 -0.295775
C  -2.577351 -1.035049 0.280134
C  2.195383 -1.510061 0.289864
C  -1.400254 -1.759503 0.653643
C  3.597886 0.176847 -0.776198
C  1.637986 2.092034 0.596944
C  -3.606803 1.036341 -0.632117
C  -3.885796 -1.615638 0.354202
C  3.183096 -2.491139 0.105665
C  4.595522 -0.805486 -0.965559
C  4.397673 -2.131928 -0.518109
C  -4.869192 0.443877 -0.550935
C  -5.008985 -0.891153 -0.052786
C  0.553678 2.898867 1.303592
H  -1.031527 1.923714 -0.692071
H  -1.464767 -2.798622 0.990724
H  3.761228 1.204505 -1.099331
H  -3.49658 2.059432 -1.009596
H  -3.993035 -2.638499 0.733224
H  2.985034 -3.510808 0.447979
H  5.531487 -0.526777 -1.459862
H  5.177637 -2.886581 -0.661857
H  -5.759216 0.99866 -0.866418
H  -6.005023 -1.343085 0.006862
H  1.036175 3.468426 2.109013
H  -0.306366 2.321149 1.663496
