program: Gaussian 09
title: 000247112
version: EM64L-G09RevD.01
frameworkgroup: C1[X(C22H16ClNS)]
method: RPBEPBE
basis: SDD
operation: Freq
keyword: #p
keyword: freq=noraman
keyword: PBEPBE/SDD
title: #p freq=noraman PBEPBE/SDD
converged: YES YES NO NO
title: Mulliken charges:
elementType: Cl S N C C C C C C C C C C C C C C C C C C C C C C H H H H H H H H H H H H H H H H
charge: -0.074078 0.219505 -0.350001 0.404868 0.551746 -0.579714 -0.372683 0.217300 -0.361464 0.419927 0.435761 -0.408339 0.406952 -0.314181 -0.471828 -0.478472 -0.372629 -0.582064 -0.414716 -0.433156 -0.424904 -0.257738 -0.242121 -0.241348 -0.246450 0.241678 0.267419 0.245936 0.250773 0.241066 0.244430 0.260736 0.279270 0.278386 0.254085 0.241331 0.243370 0.229968 0.231019 0.229859 0.230504
chargesum: 0.00000
title: Mulliken charges with hydrogens summed into heavy atoms:
elementType: Cl S N C C C C C C C C C C C C C C C C C C C C C C
charge: -0.074078 0.219505 -0.350001 0.404868 0.551746 -0.579714 -0.372683 0.217300 0.147633 0.419927 0.435761 -0.162403 0.406952 -0.063408 -0.230762 -0.234042 -0.111893 -0.024409 -0.160631 -0.191826 -0.181534 -0.027770 -0.011102 -0.011488 -0.015947
polarizability: 4.29235095e+02 -4.84128423e+00 2.31631722e+02 -2.09588687e+01 5.42853053e+01 2.18741898e+02
1716.lowfreq: -11.2133 -6.2493 -2.4919 -0.0013 0.0008 0.0019 26.2002 28.9194 38.0985
frequency: 26.1293 28.9074 38.0964 60.9021 80.4885 86.6794 116.2727 139.8889 153.4116 186.3941 205.0801 212.9347 215.3895 251.7076 266.7471 307.6072 331.8114 355.9690 374.3120 389.9095 414.9184 418.1959 452.6230 471.6069 500.0424 510.5708 517.5498 530.3106 540.2221 540.3681 583.0692 595.4121 619.3116 644.0506 664.1831 667.5976 671.6555 705.8805 734.5503 757.2822 759.8849 779.6192 790.5789 790.8026 808.0584 822.0693 824.2408 838.4942 861.4089 881.5713 882.9961 909.6521 951.5778 952.8939 965.6906 970.2397 971.2236 991.5867 992.3566 1004.3513 1026.0231 1027.3540 1038.2727 1066.1620 1100.3958 1131.2041 1139.8699 1148.8592 1155.3902 1171.0413 1174.2030 1178.7191 1224.1681 1233.2642 1237.9664 1250.8204 1258.6286 1267.0188 1276.9043 1311.4894 1333.8880 1354.8918 1368.4121 1399.8924 1402.0296 1408.3139 1414.1604 1425.2716 1427.1745 1445.9548 1448.4629 1456.9980 1470.4854 1503.7162 1508.9264 1564.0408 1574.7809 1586.6112 1599.8903 1625.9888 1629.9354 3023.5419 3067.6227 3095.8619 3123.4186 3124.2781 3129.7009 3133.5341 3133.7938 3135.9877 3148.1155 3153.9959 3154.9692 3156.7530 3158.0229 3165.2038 3167.7133
redmass: 7.3770 6.9198 8.6136 4.7629 5.7579 2.3626 4.3241 6.1129 5.4791 5.4184 4.7233 4.7828 4.6188 3.6788 6.2981 5.0596 4.7575 8.0586 7.5953 7.6348 3.5584 3.7516 4.1525 5.1321 4.3961 4.4422 6.0766 6.2419 3.6114 4.0752 3.7058 6.1458 6.9691 6.1587 5.8118 4.3053 5.4154 3.9183 2.8543 1.3118 1.3323 1.6845 2.7897 2.6796 5.4685 1.4411 1.4259 5.1450 5.8353 1.6694 1.6445 5.1619 1.3533 1.3322 3.0968 1.5409 1.5376 1.3391 1.3364 1.8835 2.2900 2.3091 4.6330 2.1435 4.2676 1.8210 1.8206 1.3429 1.2874 1.2347 1.0859 1.2613 1.9339 1.8419 2.3322 1.1657 1.7241 1.8139 1.6511 1.7599 2.4379 1.3053 2.9000 3.8826 4.0784 3.3114 4.8152 3.3844 3.2667 2.3088 1.1421 2.4860 1.1189 3.5741 3.7818 8.0604 8.2359 6.1665 6.3078 6.6047 6.9700 1.0615 1.0563 1.1030 1.0865 1.0864 1.0872 1.0875 1.0879 1.0888 1.0948 1.0946 1.0975 1.1120 1.0975 1.1005 1.0996
irintensity: 0.2712 0.2026 0.7533 0.4378 0.2244 1.5300 0.0459 0.1801 0.0956 3.2959 5.9698 3.9444 1.1820 2.3300 0.9230 1.0148 0.8208 2.3270 7.6843 1.8735 1.9254 5.7752 15.1644 8.6343 6.5841 6.2663 0.0899 3.3348 6.6953 1.7438 2.8797 9.3479 4.5753 12.8590 43.4957 33.8628 7.6670 13.9825 9.4383 27.6241 27.1228 16.5316 2.8326 16.0402 7.4365 17.8267 128.5493 3.6381 4.8304 7.0641 3.3777 30.9417 0.0161 0.2389 7.0374 4.3974 2.1565 0.0429 0.2517 4.2724 13.0909 5.3466 6.3464 3.4153 37.8309 10.3442 16.7151 10.8108 1.4845 29.7999 2.0081 11.0602 16.3160 4.2748 7.6957 14.8843 24.8739 15.2845 31.5039 12.2775 24.4222 12.2381 35.1051 124.3267 5.4367 2.8247 16.8725 15.4646 9.2067 40.5111 8.6267 22.5600 13.0655 7.6801 34.4000 56.6164 8.5560 15.7877 18.5926 10.6888 19.6347 14.5693 8.7387 6.6868 2.1758 1.8578 5.2008 1.4287 4.9842 10.1850 21.6686 29.1766 15.8490 9.7531 16.8987 37.7486 26.1079
temp: 298.150 k
press: 1.00000 atm
elementType: 17 16 7 6 6 6 6 6 6 6 6 6 6 6 6 6 6 6 6 6 6 6 6 6 6 1 1 1 1 1 1 1 1 1 1 1 1 1 1 1 1
symmnumber: 1
zpe: 822776.1 jmol-1
zpe.correction: 0.313379 hartree
zpe.thermalcorrener: 0.333489 hartree
zpe.thermalcorrenthalpy: 0.334434 hartree
zpe.thermalcorrgfe: 0.263329 hartree
zpe.sumelectzpe: -1759.134360 hartree
zpe.sumelectthermal: -1759.114249 hartree
zpe.sumelectthermalent: -1759.113305 hartree
zpe.sumelectthermalfe: -1759.184409 hartree
dipole: 0.0856 -1.9291 1.6837
dipole: 2.5619
quadrupole: -137.3219 -167.4407 -153.3198
quadrupole: 6.3399 -0.7906 15.3432
quadrupole: 15.3722 -14.7466 -0.6256 6.3399 -0.7906 15.3432
hfenergy: -1759.4477385 hartree
pointgroup: C01 [X(C22H16Cl1N1S1)]
dipole: 0.0167029 0.5517862 0.8433285 debye
polarizability: 427.9867425|-21.2719045|260.860046|11.330684|-43.536008|190.7619268 unknown
InChI: InChI=1S/C22H16ClNS/c23-13-14-24-19-11-9-16-6-2-4-8-18(16)22(19)25-20-12-10-15-5-1-3-7-17(15)21(20)24/h1-12H,13-14H2
charge 0 multiplicity 1
41 atoms
Cl 0.92206 -4.167322 -2.7319
S  -0.793814 1.243316 -1.680778
N  0.499363 -0.99781 -0.072932
C  1.356505 0.13661 -0.26454
C  -0.885154 -0.780405 0.241944
C  -1.616742 0.256858 -0.356366
C  0.901696 1.259331 -0.971582
C  2.68056 0.162907 0.320363
C  0.897971 -2.318851 -0.623119
C  -2.98663 0.513217 -0.006153
C  3.549502 1.287953 0.032664
C  -1.524835 -1.623071 1.210683
C  -3.626552 -0.373233 0.949423
C  1.733774 2.395272 -1.19729
C  -2.86493 -1.436392 1.537706
C  3.049666 2.390234 -0.736336
C  3.162971 -0.871136 1.190016
C  0.409213 -2.462419 -2.075376
C  -3.758023 1.578131 -0.579361
C  4.881462 1.294555 0.56374
C  -5.003242 -0.161087 1.28452
C  4.460173 -0.826619 1.706668
C  5.336772 0.254033 1.375466
C  -5.099269 1.757219 -0.231566
C  -5.731322 0.880383 0.705263
H  0.474226 -3.132737 -0.008513
H  1.99519 -2.412133 -0.595637
H  -0.935884 -2.410007 1.693121
H  1.333935 3.251083 -1.75048
H  -3.349784 -2.094666 2.267598
H  3.708306 3.242423 -0.937742
H  2.485019 -1.679418 1.479948
H  -0.68671 -2.430953 -2.157014
H  0.873345 -1.726582 -2.74741
H  -3.277967 2.261365 -1.288143
H  5.535591 2.14322 0.330849
H  -5.4781 -0.834096 2.008335
H  4.807493 -1.617637 2.380234
H  6.35538 0.270928 1.777598
H  -5.672895 2.578465 -0.674816
H  -6.783622 1.032975 0.967913
