program: Gaussian 09
title: 000247078
version: EM64L-G09RevD.01
frameworkgroup: C1[X(C10H8N2O3)]
method: RPBEPBE
basis: SDD
operation: Freq
keyword: #p
keyword: freq=noraman
keyword: PBEPBE/SDD
title: #p freq=noraman PBEPBE/SDD
converged: NO YES NO NO
title: Mulliken charges:
elementType: O O O N N C C C C C C C C C C H H H H H H H H
charge: -0.177561 -0.213928 -0.125534 -0.451358 -0.397215 0.000593 0.439842 0.170599 0.176477 -0.082672 -0.310019 -0.414810 -0.246467 -0.225273 -0.234014 0.338399 0.360224 0.195170 0.263783 0.238442 0.231651 0.230361 0.233309
chargesum: 0.00000
title: Mulliken charges with hydrogens summed into heavy atoms:
elementType: O O O N N C C C C C C C C C C
charge: -0.177561 -0.213928 -0.125534 -0.112959 -0.036992 0.000593 0.439842 0.170599 0.176477 0.112497 -0.046235 -0.176368 -0.014816 0.005088 -0.000705
polarizability: 1.59415194e+02 -1.06862651e+01 1.25021898e+02 -5.12136602e+00 9.53007767e+00 8.55384493e+01
1716.lowfreq: -5.2880 -0.0009 -0.0009 -0.0004 6.8148 9.3016 28.5542 47.8594 58.2668
frequency: 28.2665 47.7486 58.2538 94.2513 151.2602 159.0848 211.8326 244.9952 288.5521 325.7786 379.3202 403.9045 424.1269 472.1509 506.4603 538.2700 595.8560 606.5045 615.0069 643.4984 682.1711 695.9823 708.1108 712.7116 727.4802 769.1889 848.6297 879.5986 920.9505 961.0846 975.3755 985.0494 990.3401 996.4806 1002.8889 1034.7659 1079.2616 1120.2630 1168.8813 1176.9199 1198.8802 1215.2862 1304.3614 1316.9488 1325.6283 1355.7859 1375.8521 1383.3824 1436.2537 1484.5203 1592.7239 1610.9938 1650.2249 1695.5048 1731.4597 2889.8934 3129.5201 3139.8595 3152.0137 3165.6997 3188.0131 3585.4115 3604.3259
redmass: 5.6143 4.5715 6.8488 6.4962 6.3526 8.6739 3.3461 4.9584 7.6190 6.2862 7.4907 2.8363 7.9431 4.2301 1.2403 3.7679 4.1794 10.2051 6.3371 1.3052 4.6719 3.5727 2.0770 5.0826 5.9909 2.1593 1.2466 3.0721 1.4483 3.7651 1.3908 6.9779 6.1912 1.6239 1.9784 2.1491 1.9970 2.7746 4.6875 1.1025 1.1168 3.4249 5.9454 1.7103 1.3454 1.4703 1.3409 7.6114 2.2311 2.2048 6.1323 6.0306 9.9319 8.8253 9.7263 1.0874 1.0850 1.0888 1.0939 1.0993 1.0960 1.0802 1.0802
irintensity: 5.4835 0.1787 0.6148 0.6727 4.2613 2.9540 2.6619 0.8863 8.3909 1.8972 7.3803 0.3311 4.8551 10.7618 97.1956 4.4780 12.4031 5.7082 1.0200 202.8299 3.1980 4.4443 92.2890 37.4274 44.7992 18.2125 0.3125 21.9562 1.3438 16.7862 0.5697 25.0211 3.3041 10.3018 18.9134 10.0623 12.1588 6.2853 91.5117 6.7531 2.5248 9.7896 254.8689 9.3689 7.2063 1.7283 17.1838 0.6132 20.7564 18.3652 0.5342 3.0619 129.3760 603.9422 365.8716 99.7341 0.2620 4.8056 28.0001 24.1002 1.0463 89.4774 48.4327
temp: 298.150 k
press: 1.00000 atm
elementType: 8 8 8 7 7 6 6 6 6 6 6 6 6 6 6 1 1 1 1 1 1 1 1
symmnumber: 1
zpe: 435224.2 jmol-1
zpe.correction: 0.165768 hartree
zpe.thermalcorrener: 0.178489 hartree
zpe.thermalcorrenthalpy: 0.179433 hartree
zpe.thermalcorrgfe: 0.125131 hartree
zpe.sumelectzpe: -719.996624 hartree
zpe.sumelectthermal: -719.983903 hartree
zpe.sumelectthermalent: -719.982959 hartree
zpe.sumelectthermalfe: -720.037261 hartree
dipole: -0.6675 -1.5707 -0.6772
dipole: 1.8361
quadrupole: -84.1402 -93.4986 -86.5635
quadrupole: 10.8158 -0.5090 1.5334
quadrupole: 3.9273 -5.4312 1.5039 10.8158 -0.5090 1.5334
hfenergy: -720.162392 hartree
pointgroup: C01 [X(C10H8N2O3)]
dipole: 0.2957247 -0.6081637 0.254039 debye
dipolederiv: -0.5099172 -0.1069808 0.0357138 -0.1242433 -0.6595924 0.4060457 -0.0308631 0.3447133 -0.7462999 -1.0091926 -0.4674103 -0.0178361 -0.5998248 -0.8158877 0.0757861 0.0599857 0.1348209 -0.4674061 -0.5155458 -0.2325662 -0.1747226 -0.1626299 -0.673303 -0.3647904 -0.0383979 -0.2726907 -0.4123513 -1.0390585 -0.1273999 -0.1505546 -0.1376687 -0.4906182 -0.1952418 -0.2693974 -0.1769049 -0.563933 -0.8488458 -0.461115 0.1729625 -0.4261197 -0.9058454 0.3990906 -0.0168878 0.2714296 -0.6605958 0.1656527 0.0887344 -0.2076838 0.2431265 0.0538348 -0.1661764 -0.4059519 -0.2722843 -0.4264643 0.3110127 -0.1701845 -0.0275272 -0.0436891 -0.0725846 -0.041576 -0.0466048 0.0222677 -0.0922107 1.0649089 0.6485848 0.0876216 0.456201 0.8526917 -0.6112232 0.4458451 -0.2764535 1.013448 1.5597728 0.7403421 0.2615815 0.9184818 1.2005993 -0.3653268 0.2453832 -0.424525 1.1202331 0.6098011 0.1429585 -0.0430819 0.158808 0.8541464 0.7721938 -0.0171839 0.5802538 0.5903079 -0.1141342 -0.0912823 0.0064271 -0.054384 0.0603896 0.0014806 -0.0054096 0.0090423 -0.0460247 -0.108218 0.1024866 -0.0259821 -0.0179383 -0.019867 -0.0252102 -0.0096277 -0.0285873 -0.1354461 0.0043762 0.1245554 -0.0626648 0.1030635 0.0162836 -0.0720868 -0.0559478 -0.0687165 -0.1088276 -0.059525 -0.0750039 -0.0123539 -0.0575895 0.1008397 -0.0487422 -0.0003919 -0.038253 -0.1298075 0.0787505 -0.0389383 -0.0492992 -0.0515964 -0.0354472 -0.0085162 -0.0431404 -0.0200607 -0.1358838 0.2628002 -0.0609162 -0.0754611 -0.1007611 0.2161441 0.0521056 -0.0863575 0.0318928 0.2580997 0.2732914 -0.0764195 -0.0259254 -0.1133483 0.2521122 0.056401 0.0102889 0.0803013 0.2610923 -0.2033297 0.065056 0.146848 0.0015464 0.0417573 -0.0330621 0.1123574 -0.0685843 0.0283258 0.108852 0.0550282 -0.0064139 0.058707 0.0145636 0.0193618 -0.0090372 0.0170086 0.1191249 0.0370895 -0.0986858 0.0581314 -0.0999125 0.0172436 0.0407583 0.0416409 0.0478106 0.1191561 -0.011322 -0.0731373 0.0543072 -0.0869442 -0.0013002 0.0601795 0.0632052 0.0584211 0.1249492 0.0531979 0.05803 0.008044 0.0802822 -0.0902727 0.0433833 0.0087245 0.0436443 0.1448768 -0.1104171 0.054264 0.0478696 0.0564335 0.0841127 0.0051659 0.0477681 0.0054538 0.1456372 unknown
polarizability: 158.1639449|12.1961017|126.3680993|-5.6066943|-9.4159|85.4434965 unknown
InChI: InChI=1S/C10H8N2O3/c13-6-10(7-4-2-1-3-5-7)8(14)11-9(15)12-10/h1-6,11-12H
charge 0 multiplicity 1
23 atoms
O  -0.963009 1.528076 -1.761457
O  -3.368144 -1.982954 0.274279
O  0.116164 2.382678 1.634181
N  -1.4187 -0.780616 0.929685
N  -2.383364 -0.220474 -1.01262
C  -0.561618 0.297617 0.41916
C  0.897295 -0.088629 0.166425
C  -1.295863 0.649702 -0.940937
C  -2.489278 -1.111621 0.102897
C  -0.752888 1.540832 1.354759
C  1.809742 0.890082 -0.304555
C  1.344634 -1.416002 0.378045
C  3.156176 0.540274 -0.543359
C  2.694038 -1.759472 0.139419
C  3.604916 -0.781297 -0.318209
H  -1.258937 -1.271203 1.807553
H  -3.03817 -0.256178 -1.794603
H  -1.792992 1.589284 1.766475
H  1.47052 1.911692 -0.490967
H  0.643689 -2.18963 0.708652
H  3.853995 1.301925 -0.907317
H  3.029361 -2.789041 0.305444
H  4.651231 -1.047546 -0.50385
