program: Gaussian 09
title: 000247077
version: EM64L-G09RevD.01
frameworkgroup: C1[X(C10H7ClN2O3)]
method: RPBEPBE
basis: SDD
operation: Freq
keyword: #p
keyword: freq=noraman
keyword: PBEPBE/SDD
title: #p freq=noraman PBEPBE/SDD
converged: YES YES NO NO
title: Mulliken charges:
elementType: Cl O O O N N C C C C C C C C C C H H H H H H H
charge: -0.046657 -0.176113 -0.210025 -0.124474 -0.452709 -0.396310 -0.003740 0.453800 0.172067 0.177384 -0.079992 -0.296899 -0.403903 -0.231456 -0.206087 -0.110036 0.339625 0.362603 0.197567 0.270848 0.246060 0.259503 0.258942
chargesum: 0.00000
title: Mulliken charges with hydrogens summed into heavy atoms:
elementType: Cl O O O N N C C C C C C C C C C
charge: -0.046657 -0.176113 -0.210025 -0.124474 -0.113084 -0.033706 -0.003740 0.453800 0.172067 0.177384 0.117575 -0.026051 -0.157843 0.028048 0.052856 -0.110036
polarizability: 1.89223412e+02 1.20171060e+01 1.30273643e+02 2.98076000e+00 1.07478030e+01 8.87206412e+01
1716.lowfreq: -7.1680 -4.9540 -0.0016 0.0006 0.0007 2.4883 40.2010 42.7622 55.8720
frequency: 40.1508 42.7554 55.8555 66.1925 129.3492 154.7983 160.9767 194.7396 251.6390 262.4438 318.2547 341.0766 373.0785 409.1471 423.8011 441.5114 494.5195 510.7672 561.7008 599.6578 608.6171 623.5371 648.9234 682.7534 710.0813 717.3965 727.7749 736.9395 821.3711 826.5533 884.1224 947.4401 960.4502 964.6817 982.3091 999.3907 1005.1385 1076.7508 1097.3867 1130.6686 1170.3698 1194.3435 1217.9486 1300.0867 1302.0190 1318.5146 1356.1531 1369.6816 1375.9997 1393.6716 1478.2809 1584.1707 1599.0608 1648.2341 1694.6577 1731.1019 2893.2650 3148.8207 3168.4183 3174.1715 3193.6151 3583.1420 3600.9072
redmass: 4.5909 10.2687 5.5073 10.8605 8.2977 9.1593 8.2268 4.4625 5.2915 10.3774 7.0960 5.5771 8.6165 2.9161 7.4007 7.5861 3.6799 1.2287 3.4488 5.6076 7.4218 6.5369 1.3626 4.5111 5.6179 4.7739 6.4896 4.8073 1.6443 1.2458 3.0656 1.3926 3.3121 1.4178 6.9541 3.0727 3.3928 2.7409 2.4243 1.8389 5.3557 1.1283 3.5315 1.2771 6.4232 1.6835 1.4646 3.0220 1.7724 3.2432 2.3320 7.5829 6.1627 9.9292 8.8095 9.6879 1.0877 1.0883 1.0905 1.0963 1.0961 1.0803 1.0802
irintensity: 1.6234 2.4872 2.0350 0.3018 1.6929 0.1457 5.0187 1.9555 5.7288 1.1474 2.2675 9.6440 8.9680 0.4298 5.6764 17.3260 21.5294 96.7113 23.3277 6.0922 3.0618 3.2267 186.7867 9.5928 20.6952 30.8656 90.8554 5.9418 24.7207 1.0260 29.9548 5.8242 13.7918 2.0589 36.7147 39.7775 26.9285 39.3695 10.6162 13.9346 92.8982 1.6930 10.0769 3.0939 267.4139 5.6360 2.1961 8.9671 14.1289 16.6506 82.3500 5.2715 18.1480 127.4940 597.0349 379.7311 100.9963 3.9264 1.8046 3.0403 0.0692 95.0239 49.1268
temp: 298.150 k
press: 1.00000 atm
elementType: 17 8 8 8 7 7 6 6 6 6 6 6 6 6 6 6 1 1 1 1 1 1 1
symmnumber: 1
zpe: 409609.3 jmol-1
zpe.correction: 0.156012 hartree
zpe.thermalcorrener: 0.170014 hartree
zpe.thermalcorrenthalpy: 0.170959 hartree
zpe.thermalcorrgfe: 0.113437 hartree
zpe.sumelectzpe: -1179.386144 hartree
zpe.sumelectthermal: -1179.372142 hartree
zpe.sumelectthermalent: -1179.371198 hartree
zpe.sumelectthermalfe: -1179.428719 hartree
dipole: -1.4022 -1.1123 -0.9843
dipole: 2.0426
quadrupole: -106.4717 -107.4101 -97.5355
quadrupole: -5.8950 -0.5805 1.9915
quadrupole: -2.6659 -3.6044 6.2703 -5.8950 -0.5805 1.9915
hfenergy: -1179.5421561 hartree
pointgroup: C01 [X(C10H7Cl1N2O3)]
dipole: -0.5473442 -0.4370344 -0.3940101 debye
dipolederiv: -0.8953943 0.1144232 -0.0918898 0.1308621 -0.1337021 0.0000622 -0.1056439 0.0000742 -0.0830065 -0.5039281 -0.1070287 -0.0173465 -0.1260751 -0.6524812 -0.3969088 0.0620239 -0.3324076 -0.7638396 -0.9353084 -0.4762281 0.0230085 -0.627092 -0.8915177 -0.068382 -0.0518913 -0.1356619 -0.4698936 -0.4794808 -0.2083744 0.136172 -0.1186786 -0.7228631 0.3735375 -0.0021925 0.2721095 -0.3968623 -1.0401629 -0.1610038 0.1486067 -0.1746439 -0.5282306 0.205214 0.2711505 0.1984463 -0.5534457 -0.7960432 -0.4535403 -0.147841 -0.4459583 -0.9605053 -0.4048069 0.0438587 -0.2633827 -0.6760188 0.1866338 0.1010748 0.1716211 0.2615023 0.0677385 0.1940871 0.3829426 0.3185809 -0.4332389 0.2908463 -0.1331749 0.0018217 -0.0012213 -0.1298575 0.0334442 0.0201911 -0.0214444 -0.1038735 0.9680362 0.6712928 -0.1136535 0.5113253 0.9236407 0.577205 -0.4833495 0.209835 1.0564551 1.439322 0.7735113 -0.2737585 0.9830858 1.3170824 0.3190189 -0.2724693 0.3863901 1.1559778 0.5867164 0.0927846 0.1148985 0.0805333 0.9183449 -0.7598744 0.0863056 -0.5697707 0.5456171 0.0171389 -0.0994734 0.0107428 -0.0177208 0.0608514 0.0130404 0.0463412 0.0003056 -0.0286154 -0.0275766 0.0627887 0.0274041 -0.1088399 0.0282651 0.0291189 -0.0043421 0.0339177 -0.1238056 -0.3375911 0.1574931 0.0079964 0.1532861 -0.0462666 0.0489256 0.0018709 0.0417733 -0.0836266 -0.3628026 -0.0414372 -0.0412571 -0.0331564 0.0047203 0.0296809 -0.060513 0.0203802 -0.1001649 1.2957004 -0.1778493 0.1635021 -0.2141899 0.1579754 0.0238814 0.1732005 0.0352481 -0.0221762 0.2901754 -0.0620877 0.0727161 -0.1042243 0.2085108 -0.0384937 0.0911189 -0.0230465 0.247455 0.2957038 -0.0765904 0.0250036 -0.114013 0.2413737 -0.0513591 -0.0133951 -0.0791562 0.259505 -0.2193478 0.0482141 -0.1378672 -0.013259 0.0432774 0.0210213 -0.1128323 0.0564335 0.0411283 0.0894558 0.0571568 0.0082956 0.0585745 0.0427632 -0.0203278 0.0084024 -0.0170863 0.118068 0.0470669 -0.0844779 -0.0522874 -0.0881829 0.0136966 -0.041326 -0.0372094 -0.0460564 0.1212807 0.0321662 -0.0534505 -0.0361736 -0.0504301 0.040896 -0.0463758 -0.0394821 -0.0475594 0.1402602 0.0586737 0.0559774 0.0002853 0.0585161 -0.0037123 -0.040383 -0.0040859 -0.0379222 0.1528201 unknown
polarizability: 189.3536093|10.7155396|130.3613582|6.0834776|10.0106655|88.5027281 unknown
InChI: InChI=1S/C10H7ClN2O3/c11-7-3-1-6(2-4-7)10(5-14)8(15)12-9(16)13-10/h1-5,12-13H
charge 0 multiplicity 1
23 atoms
Cl 5.097961 -0.677076 0.3669
O  -1.354216 1.418869 1.821218
O  -3.531184 -2.220056 -0.248159
O  -0.493133 2.468322 -1.578313
N  -1.707548 -0.843658 -0.924007
N  -2.651798 -0.420939 1.064314
C  -0.936999 0.296009 -0.411934
C  0.559122 0.044195 -0.223744
C  -1.646321 0.540998 0.984504
C  -2.721779 -1.284482 -0.075848
C  -1.274329 1.543355 -1.301027
C  1.393021 1.09046 0.248315
C  1.123792 -1.225693 -0.495381
C  2.775163 0.873657 0.430324
C  2.506502 -1.453055 -0.31943
C  3.312916 -0.394318 0.137727
H  -1.553208 -1.279207 -1.831754
H  -3.272402 -0.536271 1.866514
H  -2.327595 1.508989 -1.678706
H  0.970978 2.069846 0.483251
H  0.490621 -2.054634 -0.827136
H  3.419441 1.678763 0.793887
H  2.942392 -2.433878 -0.528714
