program: Gaussian 09
title: 000247073
version: EM64L-G09RevD.01
frameworkgroup: C1[X(C6H13N3O3)]
method: RPBEPBE
basis: SDD
operation: Freq
keyword: #p
keyword: freq=noraman
keyword: PBEPBE/SDD
title: #p freq=noraman PBEPBE/SDD
converged: YES YES NO NO
title: Mulliken charges:
elementType: O O O N N N C C C C C C H H H H H H H H H H H H H
charge: -0.277322 -0.271686 -0.250323 0.018043 -0.403865 -0.649462 -0.087449 0.176831 -0.789112 -0.501585 -0.512660 0.294763 0.215533 0.222873 0.298181 0.228656 0.243339 0.202553 0.231928 0.228157 0.235337 0.207268 0.293843 0.344638 0.301519
chargesum: 0.00000
title: Mulliken charges with hydrogens summed into heavy atoms:
elementType: O O O N N N C C C C C C
charge: -0.277322 -0.271686 -0.250323 0.018043 -0.110022 -0.003305 0.128084 0.176831 -0.039401 0.176235 0.158102 0.294763
polarizability: 1.48829880e+02 -2.56741157e+00 9.32152745e+01 6.96232340e-01 -8.91087860e+00 7.71467007e+01
1716.lowfreq: -4.0265 -0.0010 0.0003 0.0008 6.3501 11.8402 29.7277 36.9081 71.6216
frequency: 29.6623 36.8638 71.6080 86.8793 97.4949 111.2802 120.6948 148.3166 161.6990 180.1718 243.8901 260.5874 276.6512 287.8489 323.2391 333.5707 427.3377 477.7646 491.3147 521.4203 534.1936 588.3292 598.8382 683.2241 712.0466 832.8421 861.3665 924.8946 943.1358 993.3529 999.6361 1029.1675 1045.9402 1069.0225 1110.4944 1114.5325 1128.7643 1144.3921 1169.3644 1271.4924 1299.8553 1319.0363 1337.6962 1387.0400 1425.8151 1434.0121 1446.3595 1455.8772 1456.0467 1473.1526 1476.1698 1480.6017 1503.3256 1601.3110 1608.3672 1683.4825 2930.5318 2947.4897 2957.7355 2960.2898 3031.2455 3032.1899 3063.9660 3109.6944 3122.4004 3123.1461 3418.9888 3537.7775 3695.2144
redmass: 4.7717 3.5454 2.6415 3.0781 2.5692 1.4502 1.7910 1.5449 1.3581 2.3392 2.9526 4.4740 1.5961 3.0782 3.4112 3.0377 3.3384 2.9794 1.2724 1.7937 4.4749 3.1179 2.9414 3.6906 8.4775 4.5596 4.8498 3.5339 3.8834 9.6857 1.8383 1.5708 2.4169 3.7096 1.2751 1.2653 3.0400 1.3424 1.9571 2.2826 2.1865 1.1392 2.0886 1.2317 1.1496 1.1343 1.1500 1.0505 1.0538 1.0511 1.0541 1.0528 1.6344 1.7286 2.7649 5.5009 1.0845 1.0345 1.0372 1.0401 1.0982 1.1008 1.0957 1.0997 1.1025 1.0945 1.0751 1.0459 1.1035
irintensity: 10.7267 9.2222 8.2362 7.1092 4.4908 4.2101 3.3374 0.7687 2.8858 0.8103 22.1670 1.9024 8.1916 2.1980 2.7771 17.3973 80.1265 39.2189 209.2764 31.5577 8.4057 35.6877 39.5551 1.9742 22.7709 43.8239 86.3717 12.1684 6.9044 120.2901 22.5354 1.3714 58.6441 189.7618 2.7929 2.0704 191.8908 4.9002 2.8855 133.4557 260.1270 11.5326 51.7985 36.1162 9.2643 5.8284 123.9166 5.6160 13.6214 32.3414 15.5091 6.6027 194.1004 127.7046 11.2612 304.4062 32.4188 58.7308 88.0687 8.7055 14.1362 56.4449 41.9427 28.4471 23.7054 1.4787 10.0661 46.4520 41.6077
temp: 298.150 k
press: 1.00000 atm
elementType: 8 8 8 7 7 7 6 6 6 6 6 6 1 1 1 1 1 1 1 1 1 1 1 1 1
symmnumber: 1
zpe: 524934.2 jmol-1
zpe.correction: 0.199937 hartree
zpe.thermalcorrener: 0.215030 hartree
zpe.thermalcorrenthalpy: 0.215974 hartree
zpe.thermalcorrgfe: 0.156609 hartree
zpe.sumelectzpe: -625.345776 hartree
zpe.sumelectthermal: -625.330684 hartree
zpe.sumelectthermalent: -625.329739 hartree
zpe.sumelectthermalfe: -625.389104 hartree
dipole: -0.7588 -2.8024 2.4028
dipole: 3.7686
quadrupole: -56.1540 -69.3821 -73.6068
quadrupole: 16.2952 -13.4021 0.2390
quadrupole: 10.2270 -3.0011 -7.2259 16.2952 -13.4021 0.2390
hfenergy: -625.5457133 hartree
pointgroup: C01 [X(C6H13N3O3)]
dipole: 0.3057567 0.2374695 -1.4312488 debye
dipolederiv: -1.0881043 -0.3771283 0.0084821 -0.3979667 -0.7855903 -0.0521593 0.0074462 -0.0968356 -0.4112036 -0.771706 0.1332886 0.1401483 0.0814361 -0.9607708 -0.3387074 0.1567344 -0.2087554 -0.5541405 -0.7019689 -0.0072846 -0.0751834 0.0236954 -0.3635894 0.0142024 -0.2981032 0.0168765 -1.1007933 0.8994161 0.0698017 0.1052101 0.1801981 -0.1215603 0.0363773 -0.5318367 0.0101765 -0.4072349 -1.7838668 -0.0192497 -0.434448 -0.1783103 -0.3248796 -0.0764137 -0.1085492 -0.0638563 -0.2263456 -1.334827 -0.0250971 0.3057535 -0.0820032 -0.7853172 0.0794102 0.4432285 0.0860742 -0.4583565 1.1925111 0.0084387 -0.1026773 0.3478228 1.2033353 0.2437841 -0.0621561 0.1884425 0.4488255 -0.1824167 -0.038108 -0.0579033 -0.1102271 -0.152329 -0.1111322 0.0535543 -0.0818453 0.4328231 -0.0694453 -0.0233841 0.0297727 -0.0264708 0.1465404 0.070026 -0.002139 0.0511964 -0.2316359 0.6045309 0.1973039 -0.0436862 0.1328438 0.3585647 -0.0622602 -0.2123295 -0.175597 0.2757474 0.2151099 0.1158129 0.033195 -0.070906 0.4134264 0.1335832 -0.1538365 0.2207377 0.4894243 2.5615532 0.1118285 0.1035628 0.0896 0.3528899 -0.0341399 0.5724033 -0.0246941 1.6168221 0.0040691 0.020446 0.0056461 -0.0159226 -0.0534856 0.0282184 -0.0430768 0.056134 -0.167327 0.0618989 -0.1081999 0.0557463 -0.0597965 -0.0707331 0.073025 -0.0076476 0.0035306 0.0295916 -0.0094164 0.0098573 -0.1025568 0.0169908 0.1298555 -0.0156445 -0.0724772 -0.0067771 0.1388034 0.0393188 0.1015683 0.0980063 0.0791141 -0.0101714 -0.0728795 0.0099001 -0.0304678 0.0089076 -0.0608753 0.0467968 0.0362185 0.1542228 -0.029192 -0.0162953 0.0914644 0.022536 0.0736875 -0.0118338 0.0106924 -0.0657477 -0.0136173 0.0256901 0.091541 0.0634737 0.1682597 -0.1424024 -0.0037465 -0.0936422 -0.0388281 -0.126626 -0.008797 -0.08405 -0.0670848 -0.1041666 0.0165263 0.0193878 0.1251293 0.009043 0.1117077 -0.0978323 -0.0366137 -0.0126466 -0.0187692 0.0799811 -0.1144371 -0.1338265 -0.0253469 -0.0615701 0.0454198 -0.0095256 0.0261393 -0.0387262 0.0250579 0.0758674 -0.0480967 0.0078084 -0.0337203 -0.0151946 0.1287584 0.0688142 0.0058528 -0.1852788 0.0072901 -0.040895 0.0232921 -0.0306537 0.3052874 0.0501578 0.0851991 0.0484823 -0.0004681 0.2369147 -0.0111907 -0.0034731 -0.0083998 0.3993857 -0.0069175 0.0152842 -0.0058233 0.1696792 0.214776 -0.0248616 -0.0120344 -0.0014413 0.3990473 -0.032345 -0.0217583 -0.0219853 0.0793092 unknown
polarizability: 147.8774149|7.8809755|74.5296603|3.226531|3.8249107|96.7847797 unknown
InChI: InChI=1S/C6H13N3O3/c1-4(5(11-2)12-3)8-9-6(7)10/h5,9H,7H2,1-3H3
charge 0 multiplicity 1
25 atoms
O  -2.493016 -1.118682 -0.640586
O  -2.431561 1.080424 0.187773
O  3.07885 0.25177 1.603582
N  0.6862 -0.007174 0.137013
N  1.913041 0.22599 -0.459482
N  4.244668 0.409937 -0.411351
C  -1.684941 -0.201917 0.109465
C  -0.382678 -0.004743 -0.633829
C  -0.422724 0.238788 -2.127625
C  -3.746309 -1.483841 0.039014
C  -1.992874 1.916913 1.313387
C  3.077717 0.28685 0.348308
H  -1.482179 -0.562724 1.144753
H  0.001583 1.227778 -2.395274
H  -1.465195 0.204299 -2.474795
H  0.141118 -0.540564 -2.679094
H  -4.379457 -0.592562 0.191353
H  -3.537151 -1.966562 1.016038
H  -4.247469 -2.201135 -0.628326
H  -2.608306 2.828969 1.266901
H  -0.921177 2.18361 1.231669
H  -2.15648 1.404091 2.283945
H  1.986079 0.379456 -1.473578
H  5.115444 0.49084 0.107276
H  4.281516 0.326388 -1.425241
