program: Gaussian 09
title: 000247057
version: EM64L-G09RevD.01
frameworkgroup: C1[X(C17H9NO3)]
method: RPBEPBE
basis: SDD
operation: Freq
keyword: #p
keyword: freq=noraman
keyword: PBEPBE/SDD
title: #p freq=noraman PBEPBE/SDD
converged: YES YES NO NO
title: Mulliken charges:
elementType: O O O N C C C C C C C C C C C C C C C C C H H H H H H H H H
charge: -0.149391 -0.215606 -0.153770 0.039499 0.283462 0.284769 0.216532 0.228339 -0.316591 -0.540425 -0.377135 -0.395625 0.225921 -0.413305 -0.360684 -0.215057 -0.229818 0.066890 -0.228375 -0.289865 0.140791 0.303525 0.253290 0.249687 0.281896 0.268995 0.234910 0.239757 0.287674 0.279711
chargesum: 0.00000
title: Mulliken charges with hydrogens summed into heavy atoms:
elementType: O O O N C C C C C C C C C C C C C C C C C
charge: -0.149391 -0.215606 -0.153770 0.039499 0.283462 0.284769 0.216532 0.228339 -0.316591 -0.236901 -0.123845 -0.145938 0.225921 -0.131409 -0.091689 0.019854 0.009939 0.066890 0.059299 -0.010154 0.140791
polarizability: 5.04487283e+02 -2.44173429e+01 1.95789233e+02 -2.67575172e+00 5.83261857e-01 8.52530279e+01
1716.lowfreq: -0.0009 -0.0004 0.0002 2.2569 3.6018 4.4457 30.4915 44.6055 57.6916
frequency: 30.4765 44.5850 57.6862 92.0139 130.5123 145.1819 154.1609 186.7200 215.0316 254.2224 271.5684 286.1804 338.7281 390.3342 402.5349 407.0822 440.8627 486.0479 488.2949 516.6749 554.8938 585.8507 594.9555 607.4629 638.7550 648.8558 684.2906 692.0630 705.5266 723.9218 728.1105 753.8757 785.2243 793.4504 818.0871 834.2082 837.6573 857.9423 876.8275 900.1708 925.3235 950.2502 961.0600 970.3598 975.7378 996.5950 999.3277 1028.1670 1035.6891 1064.2963 1073.0983 1099.7957 1139.5460 1169.5651 1183.8991 1187.1652 1216.7069 1243.5000 1278.3104 1294.0511 1310.5965 1346.9577 1389.5200 1444.3211 1445.9534 1455.9545 1475.6531 1559.6364 1578.5291 1590.2275 1600.2416 1613.2491 1629.9603 1645.3310 1709.5309 3132.5032 3142.9420 3144.6807 3146.0016 3154.4775 3169.6661 3172.7155 3210.4245 3236.1887
redmass: 7.1700 8.0099 5.5483 7.1042 4.3838 6.7374 6.7022 6.9926 8.0578 7.5321 8.4408 4.5752 5.1868 5.9231 6.4975 3.9680 3.1819 6.7743 4.7797 5.6053 7.1404 3.6393 3.7524 6.4576 6.4282 7.8158 7.9013 4.1509 5.9649 5.9191 8.0980 1.5353 2.7252 7.9190 1.6075 3.4159 5.1623 1.5994 6.4618 1.4874 1.6321 1.3336 3.7863 1.4693 1.4049 5.0115 1.3673 2.0292 2.8381 1.4912 2.6529 1.9145 1.5980 1.2320 2.6996 2.4261 2.0611 3.7855 1.4925 1.6853 1.8851 6.1296 3.8936 2.3855 2.9316 3.8695 4.2878 6.5898 7.4005 8.1439 6.9891 8.1612 10.8351 10.4641 12.2634 1.0864 1.0900 1.0905 1.0916 1.0950 1.1003 1.0958 1.0899 1.1087
irintensity: 1.1174 2.6727 9.9277 3.7295 1.8145 0.6519 1.5787 0.9301 0.4119 1.0466 4.9721 4.6944 3.5531 4.8763 5.4841 2.8627 2.4187 7.7243 6.1411 1.8201 1.6158 7.2615 5.3631 1.0099 2.7272 13.8536 10.4867 4.9501 0.5934 0.4115 63.5886 81.0534 39.5191 134.8167 60.0817 4.5189 18.8079 31.0476 4.9777 2.6134 24.4430 3.2498 27.4037 4.9719 0.9164 8.3461 0.1053 1.2536 64.4449 46.8715 3.5699 33.3257 12.3918 24.9455 222.8491 11.1488 12.8798 7.2424 6.1675 6.8131 4.3140 4.6141 14.8981 50.6217 8.1651 10.0977 1.8573 69.4190 27.8077 67.3939 1.7189 49.8205 112.4918 123.1382 708.9369 3.0678 6.7582 5.2620 2.8050 14.1440 37.9253 5.4761 1.0154 0.1054
temp: 298.150 k
press: 1.00000 atm
elementType: 8 8 8 7 6 6 6 6 6 6 6 6 6 6 6 6 6 6 6 6 6 1 1 1 1 1 1 1 1 1
symmnumber: 1
zpe: 556614.8 jmol-1
zpe.correction: 0.212003 hartree
zpe.thermalcorrener: 0.227627 hartree
zpe.thermalcorrenthalpy: 0.228571 hartree
zpe.thermalcorrgfe: 0.167860 hartree
zpe.sumelectzpe: -932.217979 hartree
zpe.sumelectthermal: -932.202355 hartree
zpe.sumelectthermalent: -932.201411 hartree
zpe.sumelectthermalfe: -932.262122 hartree
dipole: -6.5943 0.8403 3.2049
dipole: 7.3799
quadrupole: -132.4689 -116.1422 -121.4857
quadrupole: -15.9042 7.9680 -0.5524
quadrupole: -9.1033 7.2234 1.8799 -15.9042 7.9680 -0.5524
hfenergy: -932.4299824 hartree
pointgroup: C01 [X(C17H9N1O3)]
dipole: 2.5718468 -0.7730556 1.1036824 debye
polarizability: 503.0035209|-32.5724094|187.0618061|-3.0673222|32.0742519|95.4642165 unknown
InChI: InChI=1S/C17H9NO3/c19-16-8-7-15(21-16)18-10-5-6-12-11-3-1-2-4-13(11)17(20)14(12)9-10/h1-9H
charge 0 multiplicity 1
30 atoms
O  1.590322 2.56499 0.383003
O  -4.816383 -0.391868 -0.562378
O  -6.849531 0.554953 0.165312
N  -2.572297 -1.007627 -0.738303
C  1.636432 -0.997872 -0.189704
C  3.076076 -0.705678 0.026665
C  0.904774 0.223756 -0.076977
C  3.223447 0.695333 0.269633
C  1.869701 1.346461 0.215458
C  -0.481449 0.281629 -0.235245
C  0.953217 -2.190913 -0.495569
C  4.206149 -1.542307 0.024691
C  -1.184624 -0.934574 -0.518482
C  4.478236 1.273303 0.512551
C  -0.447538 -2.146973 -0.676334
C  5.47928 -0.960545 0.268557
C  5.61851 0.428473 0.509492
C  -3.464049 -0.302692 -0.114752
C  -3.43199 0.579938 1.075503
C  -4.702906 1.009927 1.337316
C  -5.62775 0.437265 0.323811
H  -0.998988 1.246379 -0.195255
H  1.485818 -3.140703 -0.609557
H  4.120012 -2.618733 -0.15846
H  4.564687 2.349241 0.696104
H  -1.009867 -3.048854 -0.936124
H  6.370543 -1.597793 0.270397
H  6.612724 0.849054 0.692921
H  -2.528096 0.793498 1.645094
H  -5.053063 1.650133 2.146136
