program: Gaussian 09
title: 000247154
version: EM64L-G09RevD.01
frameworkgroup: C1[X(C16H30N2O8S2)]
method: RPBEPBE
basis: SDD
operation: Freq
keyword: #p
keyword: freq=noraman
keyword: PBEPBE/SDD
title: #p freq=noraman PBEPBE/SDD
converged: YES YES NO NO
title: Mulliken charges:
elementType: S S O O O O O O O O N N C C C C C C C C C C C C C C C C H H H H H H H H H H H H H H H H H H H H H H H H H H H H H H
charge: 1.076339 1.073115 -0.396287 -0.432426 -0.313358 -0.301887 -0.491824 -0.598285 -0.516191 -0.538810 -0.126546 -0.122045 -0.376307 -0.382260 -0.440839 -0.409035 0.161863 0.179069 0.227703 0.255474 -0.362288 -0.391034 -0.723131 -0.683839 -0.735051 -0.698797 -0.766075 -0.772473 0.302718 0.201626 0.260190 0.285247 0.223481 0.264192 0.210131 0.231026 0.266353 0.239881 0.283667 0.228993 0.227357 0.236361 0.207757 0.219276 0.263740 0.192602 0.223524 0.238766 0.223631 0.235467 0.228002 0.203559 0.332320 0.282123 0.340538 0.318868 0.283152 0.350682
chargesum: 0.00000
title: Mulliken charges with hydrogens summed into heavy atoms:
elementType: S S O O O O O O O O N N C C C C C C C C C C C C C C C C
charge: 1.076339 1.073115 -0.396287 -0.432426 -0.313358 -0.301887 -0.491824 -0.598285 -0.516191 -0.538810 -0.126546 -0.122045 0.128036 0.163176 0.046835 0.032121 0.161863 0.179069 0.227703 0.255474 0.143947 0.121626 -0.051656 -0.008221 -0.049130 -0.031769 0.188906 0.180228
polarizability: 3.14653285e+02 3.96275041e+00 2.74036973e+02 -4.32683709e+00 -1.73839801e+00 2.18734415e+02
1716.lowfreq: -8.0761 0.0010 0.0011 0.0023 6.8621 8.9731 32.7372 39.0732 47.1082
frequency: 32.6306 39.0146 47.0896 48.7548 63.5979 67.1756 75.7809 81.1482 87.7844 98.1826 102.8001 110.0922 120.8567 134.7209 141.5359 150.0093 163.6495 173.7352 180.9962 185.9686 196.7782 202.9755 208.0422 218.8103 227.1293 236.1497 242.1980 247.4575 254.2337 262.0775 271.0868 282.4164 301.3918 309.5990 312.5950 330.1979 339.8967 342.4281 344.9292 351.0492 356.4538 361.2042 388.1474 404.0418 411.9664 420.8008 433.5556 442.9866 461.7594 470.1727 493.3103 501.2056 531.7400 539.5825 549.7710 576.1780 583.5278 591.0802 655.9043 679.6349 717.4908 726.4391 809.4708 822.7597 829.7735 831.8270 832.0715 880.2303 887.9302 895.6445 905.1370 911.2392 923.9381 925.3419 936.7985 945.5583 951.5769 960.9197 978.9547 981.7633 1006.1180 1010.5519 1017.3653 1021.2021 1034.5817 1043.7350 1050.5047 1054.8463 1063.6967 1094.2058 1145.0456 1156.9673 1161.8899 1169.7152 1173.9276 1195.3114 1199.7108 1203.0140 1212.5095 1217.9627 1230.5948 1264.9224 1275.1060 1284.8153 1328.7371 1334.7507 1337.8874 1338.9504 1343.4918 1349.7591 1355.6547 1359.8258 1370.4836 1382.9072 1389.3730 1399.4560 1404.9366 1411.1403 1415.1708 1421.9510 1435.0710 1440.9171 1442.4812 1444.2848 1452.3288 1456.6284 1458.4859 1460.4003 1466.1048 1470.4850 1475.0170 1477.8651 1480.7189 1482.9633 1487.0218 1494.3221 1526.3870 1545.8769 2970.7148 2978.3148 2981.9242 2986.2399 2988.0411 2988.8146 2990.3594 2992.8777 2995.3921 2997.1871 3001.0422 3006.4360 3037.2400 3046.7660 3077.2593 3079.3331 3089.0676 3090.1167 3093.0433 3094.7583 3097.4038 3104.8014 3115.9197 3121.7150 3129.9751 3130.9998 3131.9367 3132.4725 3167.3507 3172.0424
redmass: 6.5594 7.3381 5.1222 4.8185 7.1011 4.8845 5.3089 5.0734 3.9307 4.7524 5.2462 3.5164 1.8032 6.1877 4.0964 4.0730 2.3223 1.7240 2.7744 2.8069 3.7188 2.6783 1.8804 2.0765 2.9454 1.5633 1.3212 1.8123 3.9051 1.1262 3.0440 3.4791 4.0862 2.6792 2.7361 2.7067 7.7223 8.5286 3.1082 3.6196 3.9565 3.8303 4.1877 3.2648 2.7152 2.7092 4.2822 2.9993 3.2326 3.2651 5.8061 5.5885 3.6033 4.0224 3.7994 8.6288 7.1494 3.3369 3.3735 3.5183 6.8201 6.8126 3.8641 7.5035 3.0919 1.7108 11.6958 2.6743 2.5417 2.9070 2.9118 3.9399 3.7191 3.8074 1.9220 1.4650 1.5230 2.0419 1.7967 2.3331 2.1042 1.2586 1.4223 1.4062 1.3211 1.8762 2.0887 1.6672 1.5946 2.3226 4.1502 2.2075 2.2978 2.5194 2.2677 3.0615 2.7666 1.8272 1.4652 1.6949 1.6063 1.5122 1.4874 1.4626 1.2803 1.1373 1.2464 1.1623 1.1784 1.2339 1.6099 1.3695 1.7194 1.2100 1.2170 1.5531 1.2412 1.1016 1.3473 1.0482 1.0532 1.0746 1.0791 1.0786 1.1492 1.0712 1.0677 1.0758 1.0635 1.0710 1.0984 1.0771 1.0671 1.0777 1.0641 1.1135 5.0444 5.6734 1.0586 1.0279 1.0552 1.0259 1.0404 1.0667 1.0391 1.0669 1.0395 1.0377 1.0650 1.0656 1.1040 1.1060 1.0984 1.0990 1.0987 1.0967 1.0980 1.0991 1.0984 1.0973 1.1001 1.1073 1.1103 1.0901 1.0914 1.0979 1.1085 1.1063
irintensity: 0.5184 0.6241 1.3619 1.8499 2.9664 1.8858 8.4686 8.2789 12.7813 3.3358 1.9962 1.9463 0.7730 0.2749 1.6027 4.7019 1.7300 1.0249 7.6290 4.9628 0.2904 5.2827 0.7555 0.8908 2.0462 0.4838 0.8420 0.6237 0.2724 0.6992 2.5928 0.8339 1.7829 20.1502 2.6760 5.9790 0.8935 53.5591 13.9997 19.6574 2.8090 7.1797 0.8154 2.1414 2.8840 12.8471 32.9453 10.2944 10.6160 2.2651 60.4865 35.0294 8.0686 1.1860 2.8362 35.0978 39.6019 28.1367 4.4366 3.0231 0.4722 0.9838 17.0549 47.6500 3.7034 3.7375 65.2310 2.9411 12.2807 12.7843 33.3679 45.5896 14.4694 121.3291 4.2578 2.3805 21.8023 31.8429 15.4950 4.5037 96.7401 20.8576 14.3415 3.7118 41.9176 4.4785 6.4294 72.9543 56.4143 6.0400 25.5250 54.5553 7.2649 3.9414 33.0171 1.6727 21.3419 8.6539 19.9703 103.3673 18.7958 4.0553 40.0159 2.8989 1.7770 19.6354 7.3596 2.9702 14.4371 4.9334 14.0619 11.6153 66.7891 13.1084 29.4803 4.8173 88.9911 29.8697 49.8295 6.5927 8.8003 5.8649 14.9760 15.3478 34.7163 2.0871 17.4675 5.1076 13.1010 3.4064 20.0104 15.2747 10.9292 14.7910 16.9011 29.4016 153.8680 191.8531 13.4152 56.9234 16.4840 55.1089 11.8307 34.3360 12.0120 20.3451 54.9199 25.2610 9.4184 55.7981 10.2097 5.9995 18.1778 24.2085 30.7007 8.9311 25.4926 34.4103 32.2002 3.1550 24.8685 61.5593 37.0842 20.4402 8.9504 14.8317 5.5970 7.6996
temp: 298.150 k
press: 1.00000 atm
elementType: 16 16 8 8 8 8 8 8 8 8 7 7 6 6 6 6 6 6 6 6 6 6 6 6 6 6 6 6 1 1 1 1 1 1 1 1 1 1 1 1 1 1 1 1 1 1 1 1 1 1 1 1 1 1 1 1 1 1
symmnumber: 1
zpe: 1211904.0 jmol-1
zpe.correction: 0.461590 hartree
zpe.thermalcorrener: 0.494895 hartree
zpe.thermalcorrenthalpy: 0.495839 hartree
zpe.thermalcorrgfe: 0.399013 hartree
zpe.sumelectzpe: -2132.537023 hartree
zpe.sumelectthermal: -2132.503718 hartree
zpe.sumelectthermalent: -2132.502774 hartree
zpe.sumelectthermalfe: -2132.599600 hartree
dipole: 0.8237 -6.6693 0.0361
dipole: 6.7201
quadrupole: -188.4866 -192.9107 -187.5159
quadrupole: 1.6059 9.0541 -0.1180
quadrupole: 1.1511 -3.2730 2.1218 1.6059 9.0541 -0.1180
hfenergy: -2132.9986127 hartree
pointgroup: C01 [X(C16H30N2O8S2)]
dipole: -0.5785066 2.579689 -0.0252957 debye
polarizability: 313.6212562|7.9206521|275.2521826|2.1063726|0.8789769|218.5512352 unknown
InChI: InChI=1S/C16H30N2O8S2/c1-15(2,11-25-27(5,21)22)13(19)17-7-9-18(10-8-17)14(20)16(3,4)12-26-28(6,23)24/h7-12H2,1-6H3
charge 0 multiplicity 1
58 atoms
S  2.574321 -2.251106 -0.303568
S  -2.011011 -2.842902 0.305388
O  3.981154 -0.984562 -0.345658
O  -1.981291 -1.033049 0.881445
O  2.537812 1.011524 1.987857
O  -2.772721 0.576964 -1.975106
O  3.164919 -3.647609 -0.840748
O  1.302875 -1.570195 -1.071214
O  -3.518499 -3.406526 0.509208
O  -0.767144 -3.541203 1.068193
N  1.041848 1.568844 0.324053
N  -1.773397 1.859702 -0.334586
C  0.560798 1.462711 -1.081624
C  -0.017481 1.332653 1.347861
C  -0.732815 2.271014 -1.305421
C  -1.308947 2.120061 1.045491
C  3.59001 1.488122 -0.175724
C  -3.881639 0.483547 0.217494
C  2.350476 1.341549 0.765439
C  -2.757882 0.969238 -0.759884
C  3.702964 0.245606 -1.116166
C  -3.280501 -0.471798 1.304976
C  3.590198 2.790113 -1.031717
C  4.856963 1.527104 0.723742
C  -4.625319 1.673954 0.8912
C  -4.925599 -0.309369 -0.616725
C  2.231792 -2.3195 1.563884
C  -1.598793 -2.591929 -1.533958
H  0.369139 0.397007 -1.312493
H  1.329413 1.828039 -1.774021
H  0.391921 1.624708 2.327748
H  -0.262552 0.253692 1.386271
H  -0.543596 3.353523 -1.17234
H  -1.110235 2.08075 -2.321803
H  -2.066694 1.833048 1.785078
H  -1.126324 3.207855 1.149113
H  2.796335 0.097962 -1.735141
H  4.575154 0.368834 -1.786603
H  -3.991984 -1.297846 1.511042
H  -3.068489 0.043896 2.25997
H  4.597953 2.941183 -1.459775
H  3.363867 3.662401 -0.393441
H  2.878233 2.79256 -1.87337
H  4.833807 2.405233 1.391424
H  4.924386 0.626612 1.350658
H  5.757453 1.58841 0.084231
H  -5.400053 1.292001 1.582195
H  -5.135104 2.280245 0.1218
H  -3.965392 2.34742 1.462659
H  -5.286024 0.289653 -1.468293
H  -4.507694 -1.245358 -1.021907
H  -5.782763 -0.574522 0.029699
H  2.227845 -1.272648 1.905451
H  3.06466 -2.898172 1.986172
H  1.253844 -2.823374 1.6454
H  -2.276688 -1.803825 -1.895308
H  -1.759807 -3.571607 -2.006359
H  -0.541905 -2.275835 -1.536687
