program: Gaussian 09
title: 000247054
version: EM64L-G09RevD.01
frameworkgroup: C1[X(C17H9NO3)]
method: RPBEPBE
basis: SDD
operation: Freq
keyword: #p
keyword: freq=noraman
keyword: PBEPBE/SDD
title: #p freq=noraman PBEPBE/SDD
converged: NO YES NO NO
title: Mulliken charges:
elementType: O O O N C C C C C C C C C C C C C C C C C H H H H H H H H H
charge: -0.172779 -0.216707 -0.149873 0.047558 0.312524 -0.038000 0.257019 0.254511 -0.240361 0.126371 -0.439344 -0.384105 -0.428233 -0.377712 -0.198698 -0.219116 -0.231024 0.111779 -0.188617 -0.288172 0.145708 0.252915 0.247800 0.283526 0.264303 0.237894 0.233692 0.238695 0.281217 0.277231
chargesum: 0.00000
title: Mulliken charges with hydrogens summed into heavy atoms:
elementType: O O O N C C C C C C C C C C C C C C C C C
charge: -0.172779 -0.216707 -0.149873 0.047558 0.312524 -0.038000 0.257019 0.254511 -0.240361 0.126371 -0.186429 -0.136305 -0.144707 -0.113409 0.039195 0.014576 0.007671 0.111779 0.092600 -0.010942 0.145708
polarizability: 3.55211726e+02 1.30727093e+01 2.41555171e+02 8.67706190e+00 1.21556269e+00 9.20404613e+01
1716.lowfreq: -0.0008 -0.0007 0.0003 3.6171 4.9870 8.7569 37.4682 43.7752 62.0439
frequency: 37.4559 43.7639 62.0394 103.8646 113.7466 139.9637 148.8223 196.9446 227.4075 259.3934 271.4313 280.8735 291.5629 352.5807 415.6346 438.2678 444.5328 457.7213 509.9021 525.4162 548.5819 586.1608 594.7616 614.5225 641.2911 647.0522 670.2388 674.8920 700.5212 705.5053 745.0503 757.2041 773.4709 794.6258 814.7233 820.0133 834.0054 843.9758 887.6461 901.2930 913.0946 928.9547 940.7720 969.2331 985.1581 998.8714 1016.1381 1032.2395 1047.8821 1058.7070 1074.7747 1108.1545 1142.1734 1169.4688 1185.8110 1188.9989 1199.4484 1250.2895 1267.4909 1293.4898 1306.2968 1364.1894 1396.8922 1428.6778 1447.0698 1455.2604 1471.9620 1556.8234 1577.3258 1595.6307 1603.4275 1611.2547 1620.4917 1680.7103 1727.0610 3130.7192 3138.1879 3143.0611 3153.3717 3155.7836 3168.7121 3173.9861 3214.3983 3240.9200
redmass: 7.6733 8.9205 5.2490 5.7233 4.9453 8.3912 6.6865 5.6769 5.1540 7.7482 6.6246 4.5148 7.4862 7.4758 3.3780 4.1390 8.2716 6.9538 4.2292 5.3082 6.7329 5.1471 3.8253 6.4366 6.0562 6.1062 7.6998 3.7591 7.8657 6.0721 1.7000 6.9338 1.5268 8.4706 1.6527 1.9663 3.9774 8.2436 6.9276 1.4345 1.6173 6.5704 1.3435 1.4442 1.3591 1.3573 2.1862 2.7084 2.9361 1.5227 2.2450 2.0741 2.5696 1.1683 1.4675 2.3464 2.4291 2.6348 2.3925 1.7738 1.9833 6.2963 2.9190 2.8662 3.2976 2.6450 3.9129 8.3831 6.6904 8.6933 7.3302 7.2109 8.2469 12.1954 12.3054 1.0864 1.0871 1.0900 1.0946 1.0935 1.1003 1.0980 1.0900 1.1098
irintensity: 0.9730 0.2950 8.1909 12.9261 0.8745 0.2682 0.3682 0.2885 1.3494 1.2797 1.4868 3.8535 3.6277 1.3177 0.2001 3.5391 7.3973 5.7386 2.1768 2.7567 1.1540 1.8086 3.9786 4.4055 13.8951 3.5086 2.6855 17.2023 56.8579 13.7227 4.3214 30.0086 124.0456 171.7322 35.3311 41.8516 1.6887 25.3806 22.0462 0.2317 0.2273 32.8789 4.2315 3.0549 1.2304 0.0213 2.5656 82.2000 3.7840 62.6480 4.4236 25.4715 22.6643 9.0879 17.8524 177.8744 21.3424 1.4674 23.0449 7.0372 5.9401 4.1437 3.7116 22.8368 25.8955 28.7632 9.0042 93.4756 10.3959 241.3509 0.5669 25.5922 20.8186 717.1621 154.9936 2.0772 6.2200 3.3918 7.1439 18.2725 33.6417 12.4233 0.3517 0.0891
temp: 298.150 k
press: 1.00000 atm
elementType: 8 8 8 7 6 6 6 6 6 6 6 6 6 6 6 6 6 6 6 6 6 1 1 1 1 1 1 1 1 1
symmnumber: 1
zpe: 556324.7 jmol-1
zpe.correction: 0.211893 hartree
zpe.thermalcorrener: 0.227567 hartree
zpe.thermalcorrenthalpy: 0.228511 hartree
zpe.thermalcorrgfe: 0.167993 hartree
zpe.sumelectzpe: -932.216700 hartree
zpe.sumelectthermal: -932.201027 hartree
zpe.sumelectthermalent: -932.200082 hartree
zpe.sumelectthermalfe: -932.260600 hartree
dipole: 6.9666 1.4478 4.3441
dipole: 8.3367
quadrupole: -127.2262 -105.6234 -121.5279
quadrupole: -3.4208 -11.4061 -0.8833
quadrupole: -9.1003 12.5024 -3.4021 -3.4208 -11.4061 -0.8833
hfenergy: -932.4285933 hartree
pointgroup: C01 [X(C17H9N1O3)]
dipole: 2.6488632 0.9128755 1.7052905 debye
polarizability: 352.3264001|21.7532904|242.8656379|13.8459779|-11.8274043|93.6153203 unknown
InChI: InChI=1S/C17H9NO3/c19-15-9-8-14(21-15)18-13-7-3-6-11-10-4-1-2-5-12(10)17(20)16(11)13/h1-9H
charge 0 multiplicity 1
30 atoms
O  -0.327851 -1.609576 -0.318018
O  -3.924415 -0.209338 -0.727276
O  -5.613654 -1.73428 -0.114275
N  -2.00977 1.120143 -0.703145
C  1.691747 1.360809 0.091525
C  0.40427 0.769262 -0.12842
C  2.699909 0.273355 0.204526
C  2.03551 -0.974963 0.032026
C  0.568407 -0.725458 -0.169695
C  -0.737878 1.588185 -0.344211
C  1.85263 2.751243 0.152705
C  4.086516 0.308966 0.43092
C  2.728137 -2.194537 0.079994
C  -0.554529 3.008952 -0.317343
C  0.705358 3.570672 -0.050014
C  4.79541 -0.922076 0.478228
C  4.128625 -2.160124 0.305181
C  -2.703036 0.20221 -0.122261
C  -2.55026 -0.524991 1.162929
C  -3.62883 -1.341299 1.332698
C  -4.536588 -1.194521 0.16199
H  2.832106 3.206174 0.331382
H  4.620256 1.255934 0.566681
H  2.193319 -3.140036 -0.057079
H  -1.422805 3.643148 -0.51899
H  0.807386 4.660902 -0.02135
H  5.87746 -0.914058 0.650716
H  4.700553 -3.093173 0.344831
H  -1.699763 -0.384748 1.828186
H  -3.850319 -2.020077 2.155159
