program: Gaussian 09
title: 000247068
version: EM64L-G09RevD.01
frameworkgroup: C1[X(C16H16Cl3NO)]
method: RPBEPBE
basis: SDD
operation: Freq
keyword: #p
keyword: freq=noraman
keyword: PBEPBE/SDD
title: #p freq=noraman PBEPBE/SDD
converged: YES YES NO NO
title: Mulliken charges:
elementType: Cl Cl Cl O N C C C C C C C C C C C C C C C C H H H H H H H H H H H H H H H H
charge: -0.062554 -0.065193 -0.053127 -0.336003 -0.190665 0.364001 -0.353992 -0.399913 0.149151 -0.268589 -0.589368 -0.553519 -0.321512 -0.153759 -0.262372 0.368751 -0.324176 -0.394160 -0.223093 -0.194017 -0.254468 0.249234 0.242811 0.241241 0.284073 0.268852 0.280393 0.278178 0.267411 0.278473 0.262469 0.261593 0.254254 0.254135 0.231799 0.231444 0.232216
chargesum: 0.00000
title: Mulliken charges with hydrogens summed into heavy atoms:
elementType: Cl Cl Cl O N C C C C C C C C C C C C C C C C
charge: -0.062554 -0.065193 -0.053127 -0.336003 -0.190665 0.364001 0.138053 0.125400 0.149151 0.000264 -0.030797 -0.007635 -0.059043 -0.153759 -0.000780 0.368751 -0.069922 -0.140025 0.008706 0.037427 -0.022252
polarizability: 2.50895848e+02 2.04893198e+01 2.03153576e+02 1.75779666e+01 -4.56566684e+00 1.78806357e+02
1716.lowfreq: -7.8734 -5.3154 -0.0031 -0.0023 -0.0016 4.2206 11.8542 22.1167 26.4980
frequency: 10.3930 22.0429 26.4757 37.1950 44.3655 45.6665 56.3748 90.7573 96.2052 131.7107 155.3934 184.9745 189.4516 194.8163 235.5405 257.3744 284.2643 321.0760 334.6533 367.6496 376.6172 410.5832 429.4346 446.5640 491.6880 495.7530 499.2589 554.8898 579.2758 591.4710 603.8680 608.1942 642.9329 686.9576 691.2253 705.4695 730.9759 756.1410 775.8213 779.1986 809.3048 830.4956 843.1116 852.5797 885.9498 898.9825 914.6894 934.5305 965.9079 984.9575 986.8262 993.9941 1008.9291 1019.1506 1035.0100 1057.3816 1078.6596 1081.6112 1095.9206 1131.0535 1152.0784 1162.3189 1170.0420 1176.8481 1187.6918 1201.7686 1236.3169 1253.0667 1269.0174 1278.8740 1296.5903 1308.3875 1336.4087 1351.9652 1361.9100 1365.9721 1386.6632 1408.1654 1438.1608 1442.5777 1449.0289 1457.6829 1470.5420 1478.5468 1501.2994 1556.1949 1596.6438 1599.5657 1610.5635 2994.2223 3008.8207 3051.6738 3063.2691 3077.9477 3089.5124 3131.9335 3137.8215 3139.8869 3149.6223 3155.6994 3159.6421 3162.4314 3173.4580 3176.3061 3186.8254
redmass: 7.3404 13.7360 7.1076 4.9891 6.7641 8.0694 8.3785 2.7322 3.5128 6.0304 5.6492 5.3191 5.2120 4.5656 5.4053 6.4764 4.8626 5.3902 6.5031 3.7254 3.1212 2.9346 4.9633 3.3815 3.3166 4.0708 3.5358 4.2154 5.0629 4.7394 5.4655 6.0771 7.3599 5.2214 2.3696 5.2573 3.4567 1.5243 2.9657 1.3239 1.5848 1.2474 4.2946 1.5137 2.1257 1.4170 2.6179 1.3471 1.3617 3.8527 1.4891 1.7555 2.9591 2.1167 1.6471 3.6319 1.4950 2.1365 1.9816 1.4852 1.9814 1.4698 1.0763 1.6350 1.7081 1.9164 1.5599 1.2110 1.3399 1.2891 1.4520 1.3308 1.4449 1.4120 4.1015 1.5106 9.0556 2.8694 1.1029 2.2823 1.1869 1.1005 2.1277 2.7879 1.1245 7.2195 6.5494 7.3644 6.7626 1.0688 1.0617 1.0582 1.0569 1.0998 1.0938 1.0850 1.1106 1.0888 1.1116 1.0922 1.0896 1.0960 1.1013 1.0911 1.0969
irintensity: 0.9176 0.4381 0.4817 0.2497 0.3655 0.4598 0.3572 0.5832 4.6129 1.3468 0.5189 0.2777 4.4198 3.6918 1.9731 1.5773 2.6787 8.0225 1.1209 6.9378 2.7910 0.0433 5.2572 23.0508 12.8228 3.9261 1.6262 4.9537 13.6035 16.1877 3.1867 4.3777 7.9672 61.7597 13.5800 9.0836 17.9870 84.5457 32.2694 28.5667 49.1121 0.5250 11.3661 33.4713 12.4064 2.7361 66.1607 1.1909 0.2344 1.2788 0.7859 21.3989 10.7525 11.7034 34.1833 1.1805 11.7723 20.0428 38.3392 45.4818 24.7745 101.9813 3.1596 31.9251 116.0115 67.4144 54.0022 25.7951 7.7198 1.5678 24.8482 1.0419 28.8556 3.5198 15.9298 17.9013 3.6435 28.1744 15.6567 1.6908 6.0363 1.3238 127.5980 212.2215 27.4416 15.1609 43.8941 67.4727 99.6064 23.5179 41.5209 15.9640 17.9126 8.1475 7.5176 2.1822 13.7713 7.7023 11.8776 21.0761 2.3763 16.4262 11.3070 0.7994 0.4544
temp: 298.150 k
press: 1.00000 atm
elementType: 17 17 17 8 7 6 6 6 6 6 6 6 6 6 6 6 6 6 6 6 6 1 1 1 1 1 1 1 1 1 1 1 1 1 1 1 1
symmnumber: 1
zpe: 739984.3 jmol-1
zpe.correction: 0.281845 hartree
zpe.thermalcorrener: 0.302540 hartree
zpe.thermalcorrenthalpy: 0.303484 hartree
zpe.thermalcorrgfe: 0.227185 hartree
zpe.sumelectzpe: -2127.905537 hartree
zpe.sumelectthermal: -2127.884842 hartree
zpe.sumelectthermalent: -2127.883898 hartree
zpe.sumelectthermalfe: -2127.960197 hartree
dipole: -4.2293 0.6447 -1.6746
dipole: 4.5942
quadrupole: -146.8832 -149.0911 -146.2697
quadrupole: 5.3326 -0.5728 3.4998
quadrupole: 0.5314 -1.6764 1.1450 5.3326 -0.5728 3.4998
hfenergy: -2128.1873818 hartree
pointgroup: C01 [X(C16H16Cl3N1O1)]
dipole: -1.4991568 0.310955 -0.9606883 debye
polarizability: 233.4813392|16.1855392|205.9959739|36.5492097|8.7280711|193.3784678 unknown
InChI: InChI=1S/C16H16Cl3NO/c17-8-10-20(11-9-18)15-12-13(19)6-7-16(15)21-14-4-2-1-3-5-14/h1-7,12H,8-11H2
charge 0 multiplicity 1
37 atoms
Cl 1.507385 -3.588502 2.870348
Cl 3.588249 -1.901582 -2.24612
Cl 3.32816 2.678756 2.633377
O  -0.924679 0.96517 -1.285599
N  1.019836 -0.999405 -0.326152
C  1.054509 0.351552 0.097919
C  1.612512 -2.049504 0.533356
C  0.847297 -1.309103 -1.763881
C  0.110076 1.324123 -0.37212
C  2.025219 0.809587 1.039999
C  0.730051 -2.260637 1.774612
C  2.029367 -0.899963 -2.650174
C  0.18561 2.67555 0.009866
C  2.055622 2.156673 1.432683
C  1.164262 3.120735 0.924921
C  -2.101387 0.346871 -0.772332
C  -2.332273 0.128254 0.604222
C  -3.055489 -0.028624 -1.744723
C  -3.544145 -0.481046 1.003158
C  -4.259087 -0.636484 -1.328525
C  -4.509607 -0.867355 0.045597
H  1.657369 -2.984785 -0.046859
H  2.655615 -1.831479 0.833841
H  0.65501 -2.390474 -1.867275
H  -0.037029 -0.773242 -2.154584
H  2.773155 0.121098 1.439942
H  0.662621 -1.362137 2.405411
H  -0.272296 -2.625284 1.508749
H  1.821854 -1.103402 -3.712413
H  2.316625 0.152171 -2.505015
H  -0.556181 3.369074 -0.397792
H  1.215706 4.165157 1.240759
H  -1.590291 0.435338 1.347634
H  -2.849336 0.168254 -2.801446
H  -3.731072 -0.650526 2.069409
H  -5.00275 -0.926449 -2.078874
H  -5.445389 -1.337677 0.364582
