program: Gaussian 09
title: 000247051
version: EM64L-G09RevD.01
frameworkgroup: C1[X(C12H10BrNO5)]
method: RPBEPBE
basis: SDD
operation: Freq
keyword: #p
keyword: freq=noraman
keyword: PBEPBE/SDD
title: #p freq=noraman PBEPBE/SDD
converged: YES YES NO NO
title: Mulliken charges:
elementType: Br O O O O O N C C C C C C C C C C C C H H H H H H H H H H
charge: 0.066732 -0.304369 -0.217037 -0.254483 -0.415132 -0.243529 -0.478726 0.535617 0.382184 -0.572500 -0.347846 -0.411846 -0.143454 0.170066 0.240497 -0.300320 -0.207617 -0.495076 0.171439 0.281959 0.321227 0.255915 0.317993 0.248052 0.291923 0.231200 0.246191 0.246366 0.384573
chargesum: 0.00000
title: Mulliken charges with hydrogens summed into heavy atoms:
elementType: Br O O O O O N C C C C C C C C C C C C
charge: 0.066732 -0.304369 -0.217037 -0.254483 -0.030558 -0.243529 -0.160733 0.535617 0.382184 -0.290541 -0.026619 -0.411846 0.112461 0.170066 0.240497 -0.052268 0.084306 0.228682 0.171439
polarizability: 3.75700239e+02 -4.58594509e-01 1.85002270e+02 -2.24324516e-01 -2.70815722e-01 6.91879463e+01
1716.lowfreq: -4.5093 -0.0006 -0.0005 -0.0004 3.4503 3.6192 11.7511 25.2026 36.1920
frequency: 7.6798 25.1836 36.1405 45.4353 66.3148 90.4354 95.1682 111.0999 124.0079 130.6324 158.3346 181.2789 185.2934 217.7206 226.5034 259.3567 291.7340 314.4672 344.8277 350.6623 398.1468 437.7921 471.9047 517.3280 547.8514 574.4238 579.9305 634.8617 650.6346 652.8432 655.0652 697.8697 730.9023 731.0373 752.3797 784.9715 856.3012 863.2981 911.2644 920.3760 925.1523 948.3330 983.1621 997.1276 998.3306 1004.3765 1059.5303 1068.7015 1115.0937 1144.8933 1147.7681 1151.7212 1211.0071 1220.8781 1253.3463 1289.5011 1310.1955 1329.0299 1358.5901 1387.3159 1424.3856 1450.5058 1463.9712 1464.7169 1499.6853 1572.9227 1600.9726 1602.9279 1631.0254 1639.6772 1661.4735 3005.8766 3108.2508 3110.2690 3148.8341 3154.5837 3167.6845 3170.5554 3196.9529 3523.2388 3523.4382
redmass: 6.7726 10.4730 8.1729 7.7766 7.9961 1.5039 2.2541 5.6990 3.9451 10.8778 4.0861 11.5489 3.3702 7.3460 4.5020 6.8426 9.2594 8.5310 4.7317 6.4286 6.6848 3.3671 5.0567 6.1424 3.5130 1.6668 5.8773 6.5367 1.8447 1.3707 6.9879 3.9170 6.8882 7.8194 5.2334 6.2674 1.3564 6.7429 2.1724 6.1958 1.6218 4.5127 4.5805 1.1159 1.2897 7.7290 2.2193 4.2700 1.2623 1.4540 1.6081 1.7329 1.8875 1.5036 1.6643 2.0107 1.7714 2.4163 3.5561 7.0519 1.1740 1.0494 2.2136 1.2053 2.3126 7.2658 5.0061 5.0329 8.8237 10.3138 6.2214 1.0295 1.1046 1.0923 1.1049 1.0915 1.0910 1.0927 1.0960 1.0683 1.0725
irintensity: 1.2308 0.0504 0.0004 0.1264 5.7539 0.4682 1.3414 0.2442 11.9226 3.4120 0.0912 0.6399 0.4121 8.5297 0.8026 3.0567 4.2825 8.3320 0.0109 10.8680 13.1373 1.1019 49.9582 5.6074 75.3475 40.2111 41.7474 14.1611 121.0544 8.0796 4.7085 1.1058 11.6584 27.7123 11.6566 22.3738 37.8287 12.2331 1.3832 2.2267 36.2991 6.3408 42.8993 65.2070 2.1151 114.5077 401.4274 217.0131 0.0554 58.6102 11.4496 34.4264 213.8113 46.7904 8.3132 49.5901 87.3576 144.3905 129.1644 6.8646 19.2756 14.5299 123.2268 68.4941 309.2489 14.0823 109.8072 23.5650 261.4729 196.4877 52.5965 38.9863 24.3395 2.3756 14.1352 6.1716 3.4883 2.5551 10.6535 65.9766 21.6925
temp: 298.150 k
press: 1.00000 atm
elementType: 35 8 8 8 8 8 7 6 6 6 6 6 6 6 6 6 6 6 6 1 1 1 1 1 1 1 1 1 1
symmnumber: 1
zpe: 530289.4 jmol-1
zpe.correction: 0.201977 hartree
zpe.thermalcorrener: 0.220971 hartree
zpe.thermalcorrenthalpy: 0.221915 hartree
zpe.thermalcorrgfe: 0.149740 hartree
zpe.sumelectzpe: -906.241288 hartree
zpe.sumelectthermal: -906.222294 hartree
zpe.sumelectthermalent: -906.221350 hartree
zpe.sumelectthermalfe: -906.293525 hartree
dipole: -2.1977 3.1612 0.0220
dipole: 3.8501
quadrupole: -121.3463 -109.4629 -120.3419
quadrupole: 3.4611 0.0705 0.0719
quadrupole: -4.2959 7.5875 -3.2915 3.4611 0.0705 0.0719
hfenergy: -906.443265 hartree
pointgroup: C01 [X(C12H10Br1N1O5)]
dipole: -0.6888042 1.3471123 -0.0730451 debye
polarizability: 372.0884416|-26.0316498|188.1025277|-0.5540943|-7.6764071|69.6994869 unknown
InChI: InChI=1S/C12H10BrNO5/c1-19-12(18)8-6-7(2-3-9(8)13)14-10(15)4-5-11(16)17/h2-6,14,16H,1H3
charge 0 multiplicity 1
29 atoms
Br 4.783759 -2.430964 0.075554
O  3.471514 2.150252 -0.199172
O  5.19079 0.588702 -0.148146
O  -2.291497 -1.836442 0.078808
O  -6.933574 0.19648 -0.00217
O  -5.64164 2.128674 -0.165889
N  -0.898181 0.058989 -0.06528
C  0.391698 -0.53263 -0.032537
C  2.841519 -0.156116 -0.0682
C  1.50847 0.331333 -0.094223
C  0.601372 -1.935662 0.058941
C  3.033813 -1.565515 0.023695
C  1.917604 -2.429436 0.085801
C  3.964479 0.833472 -0.139155
C  -2.143834 -0.578848 -0.010206
C  -3.292599 0.373679 -0.066131
C  -4.577453 -0.072563 -0.015505
C  4.509643 3.20367 -0.274051
C  -5.71212 0.8784 -0.070905
H  1.373559 1.415278 -0.163827
H  -0.25429 -2.610912 0.10773
H  2.081484 -3.508248 0.1565
H  -0.91242 1.079868 -0.13469
H  -3.108371 1.45424 -0.149307
H  -4.794681 -1.142218 0.067421
H  3.948762 4.147971 -0.313479
H  5.126879 3.068353 -1.177971
H  5.160013 3.163029 0.615716
H  -7.681798 0.852162 -0.040523
