program: Gaussian 09
title: 000247041
version: EM64L-G09RevD.01
frameworkgroup: C1[X(C15H13NO2)]
method: RPBEPBE
basis: SDD
operation: Freq
keyword: #p
keyword: freq=noraman
keyword: PBEPBE/SDD
title: #p freq=noraman PBEPBE/SDD
converged: NO YES NO NO
title: Mulliken charges:
elementType: O O N C C C C C C C C C C C C C C C H H H H H H H H H H H H H
charge: -0.287089 -0.235860 -0.705055 -0.699175 0.298271 0.319661 0.198710 0.187028 -0.528984 -0.646872 -0.385100 -0.384745 0.540925 0.345915 -0.414738 -0.447196 0.263376 -0.760368 0.245091 0.245141 0.311802 0.232242 0.240419 0.233723 0.251863 0.215558 0.305690 0.306371 0.248252 0.248136 0.257007
chargesum: 0.00000
title: Mulliken charges with hydrogens summed into heavy atoms:
elementType: O O N C C C C C C C C C C C C C C C
charge: -0.287089 -0.235860 -0.092993 -0.208942 0.298271 0.319661 0.198710 0.187028 -0.217182 -0.414630 -0.144681 -0.151021 0.540925 0.345915 -0.162875 -0.231637 0.263376 -0.006974
polarizability: 3.52396318e+02 4.21046632e+00 1.74358212e+02 5.92549909e-02 -9.10426100e-02 7.76974273e+01
1716.lowfreq: -65.5970 -6.7089 -2.4143 -1.7710 -0.0005 -0.0002 0.0007 30.1200 42.8933
frequency: -65.5789 30.1035 42.8768 88.9428 97.8612 133.5682 180.4888 189.5494 235.0285 260.2735 275.5106 310.5235 348.5240 363.6091 363.9076 394.5275 416.8430 423.9248 436.8485 506.0774 516.7500 535.1242 558.7003 565.7148 600.7490 607.0862 647.5427 709.6200 718.4385 726.8201 759.3048 764.7577 815.9748 832.3987 850.8148 854.0927 905.5213 923.9457 932.5263 941.5171 953.5843 967.6803 992.4315 1002.9406 1031.3871 1043.9954 1094.3932 1117.8668 1132.4654 1133.9765 1157.8265 1182.6138 1196.8368 1201.3100 1242.4069 1281.9529 1306.1079 1331.7695 1378.6055 1384.3097 1387.2043 1426.0791 1440.6022 1454.6989 1458.4942 1463.0264 1470.9414 1500.7149 1587.9156 1594.9321 1614.8118 1637.2178 1638.4001 1644.7107 2984.2940 3007.5394 3029.1052 3094.1751 3116.2115 3117.9532 3137.2539 3142.4485 3142.8355 3169.4028 3197.8288 3571.8235 3712.8795
redmass: 1.0735 6.3453 3.9357 4.5208 5.0683 4.0682 6.1396 5.0310 2.0878 4.3698 5.0725 4.9929 1.2452 1.0500 3.8312 5.4050 4.3112 2.6114 2.9939 4.3187 4.2271 3.0386 5.8861 3.3772 2.9134 5.5377 6.5321 3.1136 6.0827 5.7629 3.3196 5.7208 1.4806 1.5605 6.1913 1.5301 1.4671 3.6813 3.1170 1.3882 1.4028 1.9521 5.4569 1.8815 1.4748 1.5960 2.0287 1.8595 1.1486 1.4838 1.4238 4.0575 2.8788 1.5667 1.8587 1.4168 1.9778 3.5449 6.1843 1.3414 3.1440 1.1687 4.0469 1.0709 1.0459 3.0165 4.7910 4.2379 7.5306 7.3409 7.3305 2.3341 3.1965 2.8652 1.0607 1.0366 1.0994 1.0972 1.0896 1.0889 1.0894 1.1009 1.0965 1.0957 1.0932 1.0448 1.1040
irintensity: 1.5320 1.3348 4.2652 0.0815 3.2476 0.8114 0.8339 4.8951 9.4409 0.6574 0.7294 5.2236 316.2541 0.5326 4.4093 2.3210 6.3465 8.1291 0.2019 2.4938 0.6403 3.9023 0.4865 0.8499 0.0409 18.9222 4.9981 8.2236 4.6627 0.5967 0.0632 1.8558 71.0879 25.5952 17.8501 30.2509 2.9145 6.0783 31.4772 1.0823 4.9921 23.8403 10.4945 73.2661 1.2517 9.6367 5.5630 123.5132 0.0112 8.0789 6.2540 646.2067 0.5995 36.9775 102.1369 2.3400 7.3499 68.6021 11.5487 32.6795 28.1945 16.6665 43.7171 18.3782 17.4176 204.5615 19.9640 20.0954 16.9842 0.6376 11.7550 77.1919 212.5392 417.0184 14.0305 7.8618 7.6939 7.2881 10.3069 36.8098 5.9842 8.5962 30.9317 10.0752 2.9297 118.2917 20.2444
temp: 298.150 k
press: 1.00000 atm
elementType: 8 8 7 6 6 6 6 6 6 6 6 6 6 6 6 6 6 6 1 1 1 1 1 1 1 1 1 1 1 1 1
symmnumber: 1
zpe: 632491.7 jmol-1
zpe.correction: 0.240903 hartree
zpe.thermalcorrener: 0.255793 hartree
zpe.thermalcorrenthalpy: 0.256737 hartree
zpe.thermalcorrgfe: 0.198481 hartree
zpe.sumelectzpe: -783.369318 hartree
zpe.sumelectthermal: -783.354428 hartree
zpe.sumelectthermalent: -783.353484 hartree
zpe.sumelectthermalfe: -783.411741 hartree
dipole: -3.0537 0.4261 0.0140
dipole: 3.0834
quadrupole: -65.0853 -96.8615 -109.8741
quadrupole: 11.2380 0.1059 -0.1246
quadrupole: 25.5217 -6.2546 -19.2671 11.2380 0.1059 -0.1246
hfenergy: -783.6102211 hartree
pointgroup: C01 [X(C15H13N1O2)]
dipole: 1.1938468 -0.2144304 0.0183396 debye
polarizability: 352.3131375|-3.8028564|171.1037043|-5.633325|-17.2657815|81.0351155 unknown
InChI: InChI=1S/C15H13NO2/c1-9(17)18-13-3-5-15-11(8-13)6-10-7-12(16)2-4-14(10)15/h2-5,7-8H,6,16H2,1H3
charge 0 multiplicity 1
31 atoms
O  -3.897276 -0.326271 0.171793
O  -4.293449 1.95417 -0.269627
N  5.846642 0.595153 -0.233172
C  0.861377 1.619175 -0.300796
C  -0.247959 0.593555 -0.085299
C  2.13078 0.781538 -0.177273
C  0.322521 -0.69672 0.138661
C  1.787514 -0.581526 0.08205
C  -1.637405 0.800628 -0.090693
C  3.466908 1.187053 -0.284688
C  -0.522098 -1.808778 0.363336
C  2.812753 -1.541781 0.233872
C  4.505599 0.218223 -0.131425
C  -2.461579 -0.33157 0.136316
C  -1.918828 -1.61934 0.360924
C  4.159425 -1.144238 0.12802
C  -4.711788 0.79946 -0.031688
C  -6.169122 0.402951 0.081261
H  0.823468 2.428353 0.454509
H  0.781313 2.106989 -1.291936
H  -2.076156 1.783944 -0.262326
H  3.723733 2.234941 -0.484343
H  -0.108447 -2.807723 0.537574
H  2.573447 -2.592601 0.433053
H  -2.607519 -2.452285 0.530698
H  4.960025 -1.884931 0.245387
H  6.588504 -0.089265 -0.125897
H  6.10442 1.559511 -0.417104
H  -6.685292 0.645943 -0.8639
H  -6.646862 1.000432 0.877154
H  -6.280851 -0.66779 0.301361
