program: Gaussian 09
title: 000247050
version: EM64L-G09RevD.01
frameworkgroup: C1[X(C17H10BrNO2)]
method: RPBEPBE
basis: SDD
operation: Freq
keyword: #p
keyword: freq=noraman
keyword: PBEPBE/SDD
title: #p freq=noraman PBEPBE/SDD
converged: YES YES NO NO
title: Mulliken charges:
elementType: Br O O N C C C C C C C C C C C C C C C C C H H H H H H H H H H
charge: -0.032473 -0.216533 -0.156263 0.034406 -0.821755 0.385109 0.187026 0.345764 0.200053 -0.530049 -0.373099 -0.380806 -0.391415 0.223858 -0.364503 -0.234736 -0.222358 0.059639 -0.223590 -0.295082 0.139800 0.327325 0.281778 0.250085 0.256247 0.245496 0.266589 0.234624 0.233235 0.292141 0.279487
chargesum: 0.00000
title: Mulliken charges with hydrogens summed into heavy atoms:
elementType: Br O O N C C C C C C C C C C C C C C C C C
charge: -0.032473 -0.216533 -0.156263 0.034406 -0.494430 0.385109 0.187026 0.345764 0.200053 -0.248272 -0.123014 -0.124559 -0.145920 0.223858 -0.097914 -0.000112 0.010877 0.059639 0.068551 -0.015595 0.139800
polarizability: 4.98177681e+02 4.44036922e+01 2.24361192e+02 -1.56481948e-01 6.79463004e+00 1.00484498e+02
1716.lowfreq: -3.1093 -0.0002 0.0004 0.0007 2.8391 6.3411 25.3575 39.1087 52.9751
frequency: 25.2543 39.0890 52.9717 67.5670 92.5681 100.6674 138.3214 149.5257 189.3611 231.0822 235.3351 267.8147 288.4818 340.5126 387.6218 407.3318 415.9107 448.2402 480.1571 491.1705 520.2796 558.0307 585.6061 593.2347 607.2604 626.7466 657.4524 670.9639 690.8010 705.8092 721.3342 744.8001 756.9668 766.9979 785.8106 816.9081 818.9654 840.9487 846.6465 862.0423 885.6660 900.2296 947.7035 949.5861 956.1410 971.0109 992.7493 994.9563 1025.9539 1036.8741 1064.7871 1094.5295 1115.7105 1120.1574 1148.0181 1170.4764 1178.8739 1185.9757 1201.0948 1223.5602 1260.5900 1288.7767 1302.8090 1312.7209 1354.8787 1390.0378 1443.1917 1449.4204 1456.5739 1482.1055 1556.8259 1574.5587 1592.5441 1598.7260 1618.1020 1637.9865 1708.4347 3080.9716 3131.6721 3139.8827 3143.2192 3144.5788 3151.6755 3168.8364 3173.7711 3208.2158 3234.5764
redmass: 7.9230 10.7086 6.0825 5.6350 7.8331 8.6693 5.2662 5.3444 7.3595 8.2679 7.7512 6.3789 4.5245 4.9548 5.6341 7.8434 3.7519 3.0684 4.7906 6.6504 4.6736 5.1488 4.2730 3.7983 5.6189 6.5913 6.2701 4.7714 6.8906 6.2385 5.8294 2.3840 4.6263 2.9496 2.1768 6.0628 1.6504 4.2983 1.7767 4.5649 1.5179 1.5089 2.2486 1.5748 1.4280 1.3739 1.4993 4.3015 2.0979 2.8440 1.4198 2.1845 1.7216 1.1561 1.3949 1.3294 1.3358 3.7121 2.0761 2.1936 2.9225 1.5083 1.7151 2.0057 6.2043 4.1493 2.4064 4.4162 2.8354 4.1788 6.5675 7.3106 6.6007 8.1181 7.3271 9.8382 12.2568 1.0874 1.0860 1.0897 1.0914 1.0904 1.0951 1.1003 1.0961 1.0904 1.1084
irintensity: 0.8328 0.3023 10.7820 0.9950 0.4915 3.6842 1.3010 1.3083 0.5224 0.7853 3.5631 1.3939 7.2200 5.4630 5.2962 5.2859 10.5072 6.2798 15.6396 7.2732 0.1176 1.5471 8.6564 8.4507 6.8557 16.7109 15.4032 11.9109 28.3665 3.8228 16.8312 62.8893 101.6248 2.7564 24.5582 80.2277 64.5171 13.7872 30.1348 11.5826 0.6885 33.1835 5.9659 1.9443 1.2623 0.2424 0.4063 3.8754 2.1350 54.8913 44.2639 1.2791 4.6141 27.2650 4.3119 8.0840 2.8424 216.6008 6.4677 9.1689 10.9219 0.2117 0.3853 3.4336 0.1415 10.5902 36.3321 2.1141 4.1251 7.9421 65.2152 11.5928 1.1932 3.4261 6.6539 75.6094 753.1764 2.1321 2.9194 1.6389 8.2735 1.3555 20.7557 40.3928 5.9896 1.3330 0.0750
temp: 298.150 k
press: 1.00000 atm
elementType: 35 8 8 7 6 6 6 6 6 6 6 6 6 6 6 6 6 6 6 6 6 1 1 1 1 1 1 1 1 1 1
symmnumber: 1
zpe: 578970.6 jmol-1
zpe.correction: 0.220518 hartree
zpe.thermalcorrener: 0.237093 hartree
zpe.thermalcorrenthalpy: 0.238037 hartree
zpe.thermalcorrgfe: 0.173898 hartree
zpe.sumelectzpe: -871.044298 hartree
zpe.sumelectthermal: -871.027723 hartree
zpe.sumelectthermalent: -871.026779 hartree
zpe.sumelectthermalfe: -871.090919 hartree
dipole: -6.6188 0.4781 -1.0589
dipole: 6.7200
quadrupole: -154.7114 -123.9502 -129.5496
quadrupole: 17.0819 -9.6490 6.4616
quadrupole: -18.6410 12.1202 6.5208 17.0819 -9.6490 6.4616
hfenergy: -871.2648167 hartree
pointgroup: C01 [X(C17H10Br1N1O2)]
dipole: 2.5869982 -0.1723748 -0.5173646 debye
polarizability: 500.8580905|35.2103632|218.9126432|-0.1681403|19.0992688|103.2526371 unknown
InChI: InChI=1S/C17H10BrNO2/c18-17-13-4-2-1-3-11(13)12-6-5-10(9-14(12)17)19-15-7-8-16(20)21-15/h1-9,17H
charge 0 multiplicity 1
31 atoms
Br 1.422154 -2.804285 -1.037768
O  -4.790025 0.530106 0.486033
O  -6.799624 -0.615752 0.029802
N  -2.553886 1.206422 0.505349
C  1.888306 -1.339499 0.361714
C  0.922723 -0.176495 0.270263
C  1.649164 1.020995 -0.01671
C  3.240029 -0.717615 0.08824
C  3.081675 0.687099 -0.128563
C  -0.464476 -0.166283 0.443057
C  0.966192 2.254728 -0.097489
C  4.509695 -1.315708 0.05529
C  4.207237 1.499722 -0.377432
C  -1.163324 1.077127 0.327332
C  -0.429169 2.279204 0.093418
C  5.639425 -0.497129 -0.196403
C  5.487057 0.895559 -0.411151
C  -3.429958 0.341656 0.095986
C  -3.368286 -0.835941 -0.801333
C  -4.63039 -1.340977 -0.948928
C  -5.577117 -0.526227 -0.143455
H  1.824743 -1.921994 1.293787
H  -1.004677 -1.086251 0.691209
H  1.506751 3.187196 -0.289805
H  4.625581 -2.394883 0.20235
H  4.101219 2.577879 -0.539402
H  -0.990476 3.217331 0.053278
H  6.63879 -0.943882 -0.228362
H  6.37215 1.510961 -0.605987
H  -2.45268 -1.182349 -1.280399
H  -4.960405 -2.183412 -1.555521
