program: Gaussian 09
title: 000247039
version: EM64L-G09RevD.01
frameworkgroup: C1[X(C14H12Cl2)]
method: RPBEPBE
basis: SDD
operation: Freq
keyword: #p
keyword: freq=noraman
keyword: PBEPBE/SDD
title: #p freq=noraman PBEPBE/SDD
converged: YES YES NO NO
title: Mulliken charges:
elementType: Cl Cl C C C C C C C C C C C C C C H H H H H H H H H H H H
charge: -0.072323 -0.061465 -0.335416 0.454647 0.609001 -0.735714 -0.370162 -0.404543 -0.374720 -0.366350 -0.221097 -0.224659 -0.235100 -0.235571 -0.113102 -0.236099 0.245494 0.227089 0.216913 0.245461 0.246671 0.252672 0.255684 0.255006 0.253270 0.256392 0.232358 0.235666
chargesum: 0.00000
title: Mulliken charges with hydrogens summed into heavy atoms:
elementType: Cl Cl C C C C C C C C C C C C C C
charge: -0.072323 -0.061465 -0.089922 0.454647 0.609001 -0.046251 -0.123492 -0.151871 -0.374720 -0.110666 0.033908 0.028611 0.021292 -0.003214 -0.113102 -0.000433
polarizability: 2.23156758e+02 -5.51639479e+00 1.44812616e+02 -1.30268555e+01 -1.04779853e-01 1.23791111e+02
1716.lowfreq: -7.5836 0.0028 0.0029 0.0032 1.5960 4.4194 23.1869 29.7819 45.2455
frequency: 22.9450 29.7670 45.2406 103.3734 142.0501 147.0012 176.8125 194.3172 275.4957 281.9883 299.3602 306.6353 351.0386 385.2398 401.8352 408.1609 452.9997 469.9781 487.8626 552.9054 593.0073 625.2808 648.1854 662.9188 720.2276 733.2405 750.8730 762.6633 808.3658 830.9414 836.3228 869.8313 950.8551 953.1635 968.3711 984.5611 988.9417 999.3650 1011.0009 1036.8288 1053.3162 1063.1806 1075.9315 1115.4630 1125.5843 1171.0561 1188.7477 1191.9317 1214.9520 1257.3148 1292.2684 1297.1251 1313.2188 1368.2067 1378.6844 1389.2269 1396.4931 1425.3147 1457.2436 1477.8454 1478.9664 1486.8352 1572.9134 1584.8406 1599.8141 1604.0479 2983.4033 2992.9803 3080.3202 3090.5895 3129.5274 3131.1217 3144.1254 3147.8062 3159.3623 3167.5997 3171.1596 3175.0846
redmass: 4.2765 6.1045 7.1933 4.3536 5.6709 6.0888 7.4576 4.5130 3.8376 1.6533 4.0540 2.1316 5.4283 7.3663 5.0569 2.9082 3.8126 4.4057 3.4922 3.5184 4.2833 6.8992 3.9388 6.1945 4.0417 3.8496 3.3353 1.2474 3.3885 1.2545 1.5758 1.3604 1.3606 1.3438 1.3732 2.2500 1.3332 4.0366 5.9500 2.0995 1.6470 2.4787 2.4039 1.5183 1.5733 1.0798 1.1237 2.1439 2.0101 1.7921 1.3355 1.3454 1.5141 5.7871 5.4058 1.6091 1.8214 2.1797 2.3304 1.4800 1.4558 1.0740 6.1246 7.3984 6.2695 6.9063 1.0374 1.0803 1.1004 1.0993 1.0899 1.0861 1.0901 1.0880 1.0951 1.0954 1.0967 1.0995
irintensity: 0.3163 0.4363 0.1780 0.6206 0.5721 0.6737 0.3726 0.9375 0.8924 0.0881 0.1752 0.3386 2.8339 5.0474 2.6394 0.3608 17.7353 3.9239 24.9408 6.5511 4.2403 0.4400 11.9696 9.3247 10.7288 1.7497 18.1737 81.4156 0.9339 0.4900 60.8995 0.4137 0.5530 1.5182 0.0898 1.3870 0.3109 60.8500 48.2731 17.6019 4.6599 2.8459 45.5946 7.2426 5.3462 1.0390 0.3323 0.2164 1.6984 3.8334 3.2154 1.9141 2.9970 4.4147 1.7342 3.7221 18.1700 23.9858 33.1157 75.5223 24.4813 10.9408 11.1164 4.2628 2.1164 3.5761 21.7237 7.2351 30.8889 26.0262 8.5868 1.2181 8.1890 5.1232 14.2836 8.1765 0.9874 13.8567
temp: 298.150 k
press: 1.00000 atm
elementType: 17 17 6 6 6 6 6 6 6 6 6 6 6 6 6 6 1 1 1 1 1 1 1 1 1 1 1 1
symmnumber: 1
zpe: 563582.0 jmol-1
zpe.correction: 0.214657 hartree
zpe.thermalcorrener: 0.229130 hartree
zpe.thermalcorrenthalpy: 0.230074 hartree
zpe.thermalcorrgfe: 0.170975 hartree
zpe.sumelectzpe: -1459.684362 hartree
zpe.sumelectthermal: -1459.669889 hartree
zpe.sumelectthermalent: -1459.668945 hartree
zpe.sumelectthermalfe: -1459.728044 hartree
dipole: 1.6205 0.9093 1.1933
dipole: 2.2083
quadrupole: -117.3619 -104.2213 -103.3792
quadrupole: 7.2797 -2.5130 -1.8655
quadrupole: -9.0411 4.0995 4.9416 7.2797 -2.5130 -1.8655
hfenergy: -1459.899019 hartree
pointgroup: C01 [X(C14H12Cl2)]
dipole: -0.7092748 0.4255297 -0.2659248 debye
polarizability: 217.8520429|23.7799858|145.825861|-7.1431625|8.1020323|128.0825817 unknown
InChI: InChI=1S/C14H12Cl2/c1-10(11-6-8-12(15)9-7-11)13-4-2-3-5-14(13)16/h2-10H,1H3
charge 0 multiplicity 1
28 atoms
Cl -2.982669 -2.532207 0.068952
Cl 5.240966 0.983878 0.842969
C  -0.371498 -0.988588 -0.866705
C  1.023764 -0.477598 -0.482257
C  -1.490962 -0.151372 -0.230104
C  -0.615265 -1.09172 -2.395287
C  1.430187 -0.547626 0.877815
C  1.939124 0.051854 -1.424386
C  -2.714726 -0.716833 0.201168
C  -1.371578 1.259465 -0.107454
C  2.704564 -0.108051 1.291874
C  3.22328 0.49969 -1.031803
C  -3.771364 0.045248 0.736272
C  -2.41344 2.051428 0.419158
C  3.585985 0.412498 0.323172
C  -3.617379 1.445132 0.845108
H  -0.46658 -2.015194 -0.46063
H  0.146179 -1.732592 -2.875629
H  -0.595751 -0.097167 -2.877173
H  -1.606259 -1.537437 -2.587274
H  0.737669 -0.950445 1.626594
H  1.666201 0.116605 -2.482171
H  -0.434089 1.730666 -0.42336
H  3.007132 -0.170269 2.341168
H  3.923617 0.904631 -1.768276
H  -4.693235 -0.446546 1.059799
H  -2.285694 3.136086 0.500703
H  -4.43108 2.048865 1.260457
