program: Gaussian 09
title: 000247040
version: EM64L-G09RevD.01
frameworkgroup: C1[X(C14H9BrCl2)]
method: RPBEPBE
basis: SDD
operation: Freq
keyword: #p
keyword: freq=noraman
keyword: PBEPBE/SDD
title: #p freq=noraman PBEPBE/SDD
converged: YES YES NO NO
title: Mulliken charges:
elementType: Br Cl Cl C C C C C C C C C C C C C C H H H H H H H H H
charge: 0.032561 -0.037269 -0.052302 0.431896 0.312626 0.375737 -0.365862 -0.399084 -0.347826 -0.355253 -0.209670 -0.209238 -0.224113 -0.227858 -0.117075 -0.227657 -0.696389 0.254132 0.267749 0.257033 0.257427 0.257843 0.259662 0.237520 0.239295 0.286114
chargesum: 0.00000
title: Mulliken charges with hydrogens summed into heavy atoms:
elementType: Br Cl Cl C C C C C C C C C C C C C C
charge: 0.032561 -0.037269 -0.052302 0.431896 0.312626 0.375737 -0.111730 -0.131335 -0.347826 -0.098220 0.047757 0.048605 0.035548 0.009662 -0.117075 0.011639 -0.410275
polarizability: 2.39212977e+02 -8.99423328e+00 2.09517164e+02 9.19821614e+00 5.29474303e+00 1.20519799e+02
1716.lowfreq: -5.5397 0.0012 0.0017 0.0019 3.5410 10.7972 17.1830 39.1682 49.3566
frequency: 16.9495 39.1493 49.3048 63.6514 81.2881 122.5715 138.9602 175.7401 193.8866 231.5226 257.5634 284.8182 306.6404 338.6351 398.1728 408.4710 412.2809 453.9062 484.6132 510.0500 569.5636 602.8941 616.7186 641.0195 662.8603 699.4554 724.8584 731.4320 754.5238 768.1928 801.0165 830.4690 836.7823 870.4947 911.2488 954.9759 958.0942 970.6471 989.7131 999.7441 1019.0821 1042.7755 1074.4083 1112.7540 1124.3972 1158.1698 1174.1560 1190.7295 1226.7299 1263.8788 1296.0168 1314.7597 1360.3038 1361.1457 1394.5894 1417.2522 1460.4107 1476.7683 1565.3612 1573.3678 1592.3551 1597.5617 1601.5759 3137.5540 3145.4106 3148.7265 3157.3006 3163.9239 3172.4341 3177.4075 3177.8075 3197.9802
redmass: 10.0466 9.8148 5.3483 6.7828 9.8150 9.0857 5.2809 9.0980 10.2784 6.2798 5.4111 6.4916 5.5025 7.6047 8.2254 3.1366 5.5394 3.6349 3.6650 4.7365 6.1868 5.9954 5.3918 4.7799 6.4822 5.7849 3.9229 3.8278 2.3411 1.7285 1.4478 1.2615 1.5691 1.3996 4.7788 1.3752 1.3781 1.3639 1.3356 4.2126 7.1899 2.1890 2.8104 1.3721 1.7102 2.5940 1.0588 1.1243 1.6291 1.4596 1.2894 1.9920 5.6835 6.1508 3.5431 2.2165 2.4811 2.4640 6.1385 7.5223 7.5991 6.5362 7.8814 1.0859 1.0892 1.0905 1.0885 1.0953 1.0961 1.0999 1.0975 1.0941
irintensity: 0.2828 0.3077 0.0839 0.1907 0.1023 0.2635 0.0281 0.8036 0.8355 0.7383 1.5767 0.4092 1.4115 4.5935 3.8486 0.3144 2.0629 17.9636 24.1805 6.9650 7.8333 21.7507 9.7479 2.0627 11.9494 25.8323 5.2723 1.2094 81.1493 52.9072 13.2121 2.5772 55.3694 0.5906 23.3315 1.0315 0.4553 1.0357 0.3139 36.1551 42.7037 6.9619 44.5407 7.8030 3.0771 0.5439 0.6081 0.1999 6.4657 9.0777 2.5249 11.9574 7.6785 1.0834 6.3510 23.8970 37.3495 78.0313 12.6171 5.9415 13.6458 16.6905 17.4396 0.6248 5.4291 7.8855 2.1017 11.6781 5.2479 14.2541 0.8767 9.3498
temp: 298.150 k
press: 1.00000 atm
elementType: 35 17 17 6 6 6 6 6 6 6 6 6 6 6 6 6 6 1 1 1 1 1 1 1 1 1
symmnumber: 1
zpe: 476951.0 jmol-1
zpe.correction: 0.181661 hartree
zpe.thermalcorrener: 0.197123 hartree
zpe.thermalcorrenthalpy: 0.198067 hartree
zpe.thermalcorrgfe: 0.135339 hartree
zpe.sumelectzpe: -1471.275828 hartree
zpe.sumelectthermal: -1471.260366 hartree
zpe.sumelectthermalent: -1471.259422 hartree
zpe.sumelectthermalfe: -1471.322150 hartree
dipole: 2.0411 -2.5247 -1.7181
dipole: 3.6732
quadrupole: -122.7502 -115.8356 -119.8038
quadrupole: -10.9953 0.7620 -0.6296
quadrupole: -3.2870 3.6276 -0.3406 -10.9953 0.7620 -0.6296
hfenergy: -1471.4574894 hartree
pointgroup: C01 [X(C14H9Br1Cl2)]
dipole: -1.0971925 0.8174288 -0.4652029 debye
dipolederiv: -0.3188263 0.4804596 0.0402571 0.2611966 -0.5469876 -0.0686396 -0.0090894 0.0064543 -0.0126762 -0.1180348 0.0055367 -0.0018766 0.0113646 -0.3751339 0.3328558 0.0500278 0.3262783 -0.3974536 -0.769915 -0.3837622 0.014769 -0.3903098 -0.3068938 -0.0247002 0.009027 -0.0263741 -0.1019395 0.3006353 0.3130257 0.0176379 0.1148249 -0.1050961 0.0140732 0.0951951 -0.0077259 -0.0234106 -0.0021304 0.1213513 0.0135007 0.1649759 0.0062239 -0.0158447 -0.0494191 -0.0415906 -0.0089655 0.1028128 -0.1883506 -0.0406908 -0.2154475 -0.0968873 0.1520942 -0.0501783 0.1708126 -0.0999704 -0.007385 -0.0451767 -0.0725622 0.090644 -0.0071661 0.0428245 -0.0298958 0.0943785 -0.0184067 0.019634 0.05353 -0.0080623 -0.0176239 -0.0316991 0.1095711 -0.082226 0.0249963 -0.0081206 0.0713461 -0.0894026 0.0045801 0.052853 0.4420222 -0.6037814 -0.1435956 -0.48961 0.5197337 -0.0922159 0.0522605 -0.0266899 0.0364742 -0.0699404 -0.0704219 -0.0399009 -0.0817532 -0.0347872 -0.3371037 -0.1007932 0.03869 -0.0866828 -0.0926649 0.0708431 0.0643805 0.1054587 -0.0389696 -0.2435343 -0.1655848 -0.0972406 -0.190203 -0.1899022 0.0115867 -0.104473 -0.0194014 -0.0413147 -0.0789337 0.0687672 -0.0875836 0.0518175 -0.2148139 0.1018478 -0.0779959 0.0983046 -0.1233178 -0.0976154 -0.0478308 -0.0044877 -0.0363857 -0.0007391 -0.1185146 0.0004852 -0.109659 -0.0367957 1.041908 0.5733147 -0.0541662 0.5967453 0.3387309 0.0890922 -0.0227656 0.0924877 0.0569902 0.0097505 -0.0525098 -0.0797602 -0.0919018 -0.0112742 -0.054821 -0.0267621 -0.0910642 -0.037603 0.2331097 -0.756645 -0.0366417 -0.4868375 0.743865 0.0771553 0.0182942 -0.0188945 -0.2411281 0.0215187 0.0119591 0.0934722 0.0161735 0.0965721 -0.0282106 0.1139634 -0.03314 0.04419 0.082824 -0.0321521 -0.0203851 -0.0269565 0.0310815 -0.0953941 -0.020119 -0.0721317 0.0532293 0.049591 -0.0095778 0.0980914 -0.026694 0.0879705 0.0315554 0.1238492 0.0356274 0.0374328 0.089191 -0.0418383 -0.0039567 -0.0438648 0.0460285 -0.0942895 -0.0075047 -0.0924459 0.0624917 0.0183507 -0.0092387 0.0838101 -0.0021382 0.1164682 -0.0434489 0.0823561 -0.0415838 0.0613213 0.0344348 0.0135172 0.0796681 -0.0007868 0.1117374 0.0469152 0.0994372 0.0392306 0.0522918 0.086851 0.0394663 0.0160941 0.0536545 -0.0073221 0.1166253 -0.0054099 0.1258168 0.043224 -0.0279677 0.1119161 0.0299214 0.1187758 0.0376697 0.0281057 0.0371066 0.022782 0.1128089 -0.0682952 0.0777584 0.0036116 0.0463324 -0.0018493 -0.0070789 -0.0247871 -0.0172534 0.1811456 unknown
polarizability: 235.6165003|-1.9440017|207.5334257|-27.5329822|-3.3337431|126.1000136 unknown
InChI: InChI=1S/C14H9BrCl2/c15-9-13(10-5-7-11(16)8-6-10)12-3-1-2-4-14(12)17/h1-9H
charge 0 multiplicity 1
26 atoms
Br 0.826191 -3.811588 -0.498307
Cl -2.487849 -1.783618 2.108625
Cl 5.000491 1.918529 -0.226479
C  -0.351415 -1.091551 -0.252626
C  0.962191 -0.382523 -0.260631
C  -1.580979 -0.236004 -0.097114
C  1.202159 0.655533 0.682039
C  1.980059 -0.68644 -1.204799
C  -2.605542 -0.444742 0.864269
C  -1.744862 0.877152 -0.972292
C  2.427425 1.353517 0.70556
C  3.208011 0.009049 -1.200439
C  -3.740909 0.38749 0.950167
C  -2.872841 1.718049 -0.906136
C  3.415941 1.016995 -0.239617
C  -3.879129 1.470871 0.056222
C  -0.548144 -2.431945 -0.401511
H  0.428026 0.913146 1.412437
H  1.812253 -1.460911 -1.958444
H  -0.9635 1.06638 -1.716088
H  2.60886 2.141094 1.442289
H  3.984667 -0.226672 -1.933489
H  -4.499966 0.19032 1.712574
H  -2.967214 2.559217 -1.60039
H  -4.761263 2.116256 0.121135
H  -1.540563 -2.886105 -0.412756
