program: Gaussian 09
title: 000247032
version: EM64L-G09RevD.01
frameworkgroup: C1[X(C12H13N3O2S)]
method: RPBEPBE
basis: SDD
operation: Freq
keyword: #p
keyword: freq=noraman
keyword: PBEPBE/SDD
title: #p freq=noraman PBEPBE/SDD
converged: YES YES NO NO
title: Mulliken charges:
elementType: S O O N N N C C C C C C C C C C C C H H H H H H H H H H H H H
charge: 0.233116 -0.374972 -0.286684 -0.469204 -0.330180 0.071082 0.404531 0.056164 -0.613518 0.480919 -0.461910 0.091091 -0.451676 0.076514 -0.182097 -0.820282 -0.238155 -0.801378 0.337951 0.314946 0.242904 0.236221 0.226740 0.346219 0.238517 0.233240 0.225658 0.388489 0.244002 0.290090 0.291662
chargesum: 0.00000
title: Mulliken charges with hydrogens summed into heavy atoms:
elementType: S O O N N N C C C C C C C C C C C C
charge: 0.233116 0.013517 -0.286684 -0.131254 0.016039 0.071082 0.404531 0.056164 -0.298572 0.480919 -0.219006 0.091091 -0.215455 0.076514 0.044643 -0.122867 -0.238155 0.024377
polarizability: 3.15573603e+02 1.00311473e+01 1.86741727e+02 -1.08557139e+01 5.50751122e-01 9.80850831e+01
1716.lowfreq: -38.8624 -9.3990 -6.5696 0.0009 0.0010 0.0013 6.4872 35.6489 42.1189
frequency: -38.4563 35.6016 42.0955 51.5261 62.8284 88.0340 115.5387 145.2378 166.2942 196.5805 204.3382 223.5254 248.9055 253.0632 285.0275 323.6223 359.8439 362.6860 441.1217 452.2092 463.8607 512.4897 514.4823 544.5632 554.3039 563.6951 588.7799 599.4366 626.6486 638.9547 663.8436 698.2120 707.1177 728.6690 745.5291 784.5094 791.5874 880.0585 904.4482 928.8339 941.2340 975.5239 985.0740 987.8828 996.4417 1010.2141 1048.6712 1050.8553 1094.2571 1109.2920 1179.5964 1183.3031 1212.8497 1228.4357 1278.0290 1298.6181 1314.5551 1345.8444 1384.4629 1389.3686 1396.4885 1417.6869 1431.9662 1434.4731 1449.6634 1465.6592 1470.2927 1480.9969 1519.6240 1546.7855 1559.4936 1596.1108 1609.4841 1615.9596 2977.9592 3030.1644 3058.5767 3088.7401 3125.3809 3126.8450 3139.0562 3157.9133 3158.8442 3165.8443 3341.3021 3464.5619 3509.1667
redmass: 1.0194 5.3733 3.1025 3.8217 4.4663 1.3125 4.7267 3.9947 7.9313 6.0950 3.5921 5.5525 4.9920 4.8839 6.1123 4.9691 4.3021 4.3985 1.5890 3.2978 2.7744 4.8884 7.6329 6.8937 5.0583 3.0511 3.1758 2.6173 5.2182 4.2627 7.3044 2.6789 1.7672 3.2058 4.6548 4.4725 1.9263 1.3615 9.3449 1.8011 1.5761 1.4312 4.1730 1.1750 1.3251 1.6705 2.2256 2.3736 1.7845 2.7085 1.2169 1.6622 1.9080 3.9927 2.3072 3.1034 1.4662 1.1354 3.7755 3.6214 1.2354 2.3210 1.0516 3.0532 1.0705 1.6637 1.0880 1.3684 2.2005 5.0709 9.1823 5.5084 6.1409 6.0013 1.0380 1.0279 1.0962 1.0994 1.0885 1.0880 1.0922 1.1046 1.0996 1.1061 1.0669 1.0750 1.0780
irintensity: 0.4808 1.1325 1.4057 1.3309 1.0151 0.6579 0.6353 1.6342 5.5526 7.3324 3.2849 0.8481 2.4468 12.1941 2.0715 9.4420 32.4353 3.9582 80.9693 15.3183 18.2693 3.5204 2.5408 2.2247 11.4645 43.5219 41.5582 30.9258 20.0171 14.7524 5.2796 16.6038 57.7339 33.3390 23.9653 32.7813 50.3149 0.6253 34.7514 8.7147 0.4868 0.7299 2.3511 8.8067 9.8064 0.8695 22.0954 12.4888 8.0869 10.3055 5.8843 40.2102 74.2714 89.8624 40.6118 17.3577 7.7030 4.8078 86.6451 18.1591 14.2891 17.7505 14.9603 57.2804 11.0924 28.0850 12.0702 25.3036 446.9998 224.3599 273.5574 151.9717 402.2608 236.9076 27.4609 17.7464 16.9991 19.8150 1.0686 9.0142 17.6211 7.0550 25.1279 6.7992 246.9038 73.7848 54.2511
temp: 298.150 k
press: 1.00000 atm
elementType: 16 8 8 7 7 7 6 6 6 6 6 6 6 6 6 6 6 6 1 1 1 1 1 1 1 1 1 1 1 1 1
symmnumber: 1
zpe: 615189.5 jmol-1
zpe.correction: 0.234313 hartree
zpe.thermalcorrener: 0.251182 hartree
zpe.thermalcorrenthalpy: 0.252126 hartree
zpe.thermalcorrgfe: 0.188630 hartree
zpe.sumelectzpe: -1176.556751 hartree
zpe.sumelectthermal: -1176.539882 hartree
zpe.sumelectthermalent: -1176.538938 hartree
zpe.sumelectthermalfe: -1176.602434 hartree
dipole: 0.2854 -1.8951 0.1640
dipole: 1.9235
quadrupole: -90.5388 -115.8257 -116.6271
quadrupole: 3.2695 -1.2924 -7.2267
quadrupole: 17.1251 -8.1618 -8.9633 3.2695 -1.2924 -7.2267
hfenergy: -1176.7910641 hartree
pointgroup: C01 [X(C12H13N3O2S1)]
dipole: -0.1053577 -0.724681 0.1908241 debye
polarizability: 314.0033441|-15.2707421|176.9144588|-18.613301|-27.1554206|109.4826102 unknown
InChI: InChI=1S/C12H13N3O2S/c1-7-4-3-5-8(6-7)13-9-10(16)14-12(18-2)15-11(9)17/h3-6,13-14,17H,1-2H3
charge 0 multiplicity 1
31 atoms
S  4.984051 -0.622684 -0.515585
O  0.328044 -0.965121 1.416032
O  1.247316 2.540426 -1.841563
N  -0.693012 1.306779 -0.337008
N  2.877445 0.997255 -1.1432
N  2.389233 -0.734822 0.40337
C  -1.919383 0.646712 -0.12009
C  0.598582 0.753851 -0.343438
C  -2.047317 -0.76784 -0.247019
C  -3.289182 -1.414115 -0.002197
C  -3.065089 1.419506 0.226441
C  1.548545 1.499984 -1.169881
C  -4.409055 -0.632482 0.367522
C  1.084559 -0.288516 0.471574
C  -4.293387 0.777152 0.459237
C  -3.407411 -2.917781 -0.180072
C  3.24219 -0.102994 -0.380835
C  4.966672 -2.042439 0.716702
H  -0.718918 2.257876 -0.724521
H  -1.217453 -1.35428 -0.659808
H  -2.974554 2.506956 0.328258
H  -5.370273 -1.118683 0.567261
H  -5.169391 1.376876 0.730881
H  3.55947 1.498938 -1.721374
H  -3.419194 -3.18939 -1.253243
H  -2.555355 -3.44944 0.280765
H  -4.337359 -3.304416 0.27043
H  -0.651542 -0.78551 1.310738
H  5.99464 -2.436137 0.720531
H  4.247194 -2.80294 0.385405
H  4.679332 -1.661521 1.705785
