program: Gaussian 09
title: 000247034
version: EM64L-G09RevD.01
frameworkgroup: C1[X(C9H10Cl2N4O2)]
method: RPBEPBE
basis: SDD
operation: Freq
keyword: #p
keyword: freq=noraman
keyword: PBEPBE/SDD
title: #p freq=noraman PBEPBE/SDD
converged: YES YES NO NO
title: Mulliken charges:
elementType: Cl Cl O O N N N N C C C C C C C C C H H H H H H H H H H
charge: -0.051213 -0.051103 -0.239791 -0.191305 -0.106977 -0.143637 -0.400311 0.002535 -0.318868 -0.322350 -0.553819 -0.568425 -0.197172 0.240318 0.201650 0.106344 -0.193202 0.249340 0.241958 0.246218 0.248836 0.306394 0.282708 0.271372 0.259189 0.306624 0.374686
chargesum: 0.00000
title: Mulliken charges with hydrogens summed into heavy atoms:
elementType: Cl Cl O O N N N N C C C C C C C C C
charge: -0.051213 -0.051103 -0.239791 -0.191305 -0.106977 -0.143637 -0.025625 0.002535 0.172429 0.172704 0.000261 -0.002611 0.109222 0.240318 0.201650 0.106344 -0.193202
polarizability: 2.13629330e+02 2.75226228e-01 1.25192437e+02 1.11437082e+01 -1.25970198e+00 1.27246186e+02
1716.lowfreq: -5.3830 -2.8447 -0.0006 0.0010 0.0010 5.4926 23.8567 34.5998 44.2269
frequency: 23.7264 34.4391 44.2218 56.2825 68.5759 80.6130 99.2633 116.8376 126.8277 172.4735 197.3268 200.6898 205.9679 218.9807 287.9951 296.4980 350.3822 387.7314 396.0264 417.2839 451.6842 500.5598 517.8205 534.4859 629.5656 662.7927 679.5899 687.8315 698.5725 732.4394 743.8303 763.6058 772.6426 790.4512 797.2123 915.7577 931.3670 980.2154 1018.0365 1027.6702 1028.2784 1109.7472 1114.4386 1118.5828 1195.8527 1229.4797 1236.8409 1253.8652 1260.9926 1287.7030 1302.7610 1314.2159 1342.3886 1358.1132 1360.4428 1368.3481 1380.6369 1442.3530 1448.0690 1456.8660 1465.8910 1597.3137 1648.7939 1663.5605 2192.0034 3001.7601 3004.7406 3066.6054 3070.6816 3077.2988 3083.6416 3169.2825 3172.2729 3191.3315 3507.5525
redmass: 9.9349 7.2530 10.2511 5.1129 3.4970 2.5977 5.9978 5.8601 10.2116 6.3896 6.0702 6.5358 4.5075 9.9690 3.1690 8.8837 12.2618 5.7688 3.6088 10.4551 12.2284 5.3472 5.6205 6.5989 6.9893 5.8295 5.3958 6.2937 2.7143 3.9907 8.4199 1.2316 1.2463 2.2312 3.9647 3.4051 1.3957 1.6371 2.1081 2.3326 4.0383 2.6486 1.4713 4.8372 4.4592 1.9419 2.0652 1.1799 1.2134 1.9951 2.5460 1.2870 1.5349 1.2246 1.3161 2.6382 1.9614 1.0800 1.0809 1.1031 1.0994 6.6061 11.7077 6.2978 12.6172 1.0605 1.0616 1.1020 1.0906 1.0719 1.0573 1.1112 1.1107 1.0952 1.0770
irintensity: 0.9100 0.9998 0.5796 2.0795 0.8744 1.0578 0.7107 2.6349 2.3298 11.1296 8.6004 4.2893 0.3840 1.4644 9.0387 0.9137 15.8513 21.3999 1.4215 9.9412 1.4669 19.3221 9.4906 13.1798 24.9254 5.7565 61.4624 49.5553 14.9778 11.4050 1.5739 1.5790 20.5425 123.0449 7.6417 8.7512 16.5226 4.8063 5.8578 11.2565 2.7457 48.6056 30.6779 3.2237 30.1900 13.7374 15.7429 5.8930 7.4928 108.0335 63.8606 8.9986 23.5084 1.0708 5.7056 61.8695 31.4844 11.0572 7.0996 9.8137 16.2083 6.1069 214.5303 837.2595 27.3223 9.4107 18.3725 3.5714 11.1915 22.3340 8.5986 11.8739 10.4070 2.6477 70.7452
temp: 298.150 k
press: 1.00000 atm
elementType: 17 17 8 8 7 7 7 7 6 6 6 6 6 6 6 6 6 1 1 1 1 1 1 1 1 1 1
symmnumber: 1
zpe: 503274.8 jmol-1
zpe.correction: 0.191687 hartree
zpe.thermalcorrener: 0.209149 hartree
zpe.thermalcorrenthalpy: 0.210093 hartree
zpe.thermalcorrgfe: 0.143085 hartree
zpe.sumelectzpe: -1637.241175 hartree
zpe.sumelectthermal: -1637.223714 hartree
zpe.sumelectthermalent: -1637.222770 hartree
zpe.sumelectthermalfe: -1637.289778 hartree
dipole: 3.6327 0.0824 -0.4918
dipole: 3.6668
quadrupole: -159.5103 -126.0155 -114.1177
quadrupole: 0.2403 -8.8283 0.0789
quadrupole: -26.2958 7.1990 19.0968 0.2403 -8.8283 0.0789
hfenergy: -1637.4328627 hartree
pointgroup: C01[X(C9H10Cl2N4O2)]
dipole: -1.4377736 0.016575 -0.1170095 debye
polarizability: 212.0969543|-3.2273703|125.3814254|-15.5718758|1.9002198|128.5895735 unknown
InChI: InChI=1S/C9H10Cl2N4O2/c10-1-3-14(4-2-11)15-6-7(5-12)8(16)13-9(15)17/h6,13H,1-4H2
charge 0 multiplicity 1
27 atoms
Cl -3.435871 -3.423314 0.105306
Cl -3.584778 3.410242 -0.125873
O  -0.702626 0.17463 2.023397
O  3.910854 0.019963 1.292938
N  -1.238842 0.016425 -0.761782
N  0.060246 0.016508 -0.212134
N  1.597183 0.095213 1.59323
N  4.410509 -0.216194 -2.415651
C  -1.94926 -1.276223 -0.835816
C  -1.931102 1.31699 -0.898364
C  -2.516336 -1.817007 0.495428
C  -2.810596 1.738234 0.299171
C  1.134953 -0.059241 -1.088829
C  0.252907 0.101097 1.212477
C  2.45403 -0.066417 -0.670711
C  2.76889 0.014853 0.773394
C  3.520741 -0.148022 -1.619991
H  -1.272672 -2.036103 -1.270297
H  -2.780883 -1.138756 -1.550919
H  -2.563834 1.266076 -1.804603
H  -1.168414 2.0951 -1.080762
H  0.856373 -0.112263 -2.143483
H  -1.741677 -2.084813 1.225294
H  -3.254109 -1.14767 0.957604
H  -3.658827 1.058227 0.463714
H  -2.243315 1.880346 1.227081
H  1.768457 0.157321 2.603578
