program: Gaussian 09
title: 000247066
version: EM64L-G09RevD.01
frameworkgroup: C1[X(C15H11F3N2O4)]
method: RPBEPBE
basis: SDD
operation: Freq
keyword: #p
keyword: freq=noraman
keyword: PBEPBE/SDD
title: #p freq=noraman PBEPBE/SDD
converged: YES YES NO NO
title: Mulliken charges:
elementType: F F F O O O O N N C C C C C C C C C C C C C C C H H H H H H H H H H H
charge: -0.162325 -0.158273 -0.165792 -0.257219 -0.199931 -0.168661 -0.253960 -0.460527 0.010050 0.251320 0.335884 0.259877 -0.493394 0.362811 -0.297643 -0.314205 0.515767 -0.479098 0.259910 -0.403963 -0.470778 -0.165044 0.228322 -0.777641 0.314317 0.285144 0.266980 0.347078 0.273426 0.228598 0.237362 0.309901 0.214671 0.262760 0.264281
chargesum: 0.00000
title: Mulliken charges with hydrogens summed into heavy atoms:
elementType: F F F O O O O N N C C C C C C C C C C C C C C C
charge: -0.162325 -0.158273 -0.165792 -0.257219 -0.199931 -0.168661 -0.253960 -0.150626 0.010050 0.251320 0.335884 0.259877 -0.179077 0.362811 -0.012498 -0.047226 0.515767 -0.132020 0.259910 -0.130537 -0.242180 0.072317 0.228322 -0.035930
polarizability: 2.65593205e+02 5.11336861e+00 2.20130898e+02 -2.97221041e+01 -9.22387239e+00 1.37383509e+02
1716.lowfreq: -16.5016 -3.8991 0.0000 0.0003 0.0005 0.3206 6.2565 14.4486 21.3343
frequency: -16.2761 14.4367 21.3151 38.0516 45.3871 62.2654 68.8976 75.4471 102.7502 125.9250 131.2744 147.9500 170.3503 219.0088 228.0152 253.7304 265.0801 288.3224 330.8918 333.6826 344.1779 365.8489 385.6136 416.7493 425.9223 451.5536 471.9679 502.3174 516.0556 534.8177 556.3726 576.8512 591.3742 608.3476 639.1694 646.4200 651.6466 660.1404 682.6517 691.1348 695.6762 733.3499 745.5497 794.7013 797.0703 831.2026 858.1119 888.3609 921.5644 929.6745 933.2205 954.5772 968.8791 972.5304 984.1030 986.6219 1004.5077 1033.2673 1036.4078 1041.0559 1067.5194 1088.4640 1128.4181 1168.7137 1177.4999 1202.0976 1221.6556 1242.0168 1252.0326 1270.4884 1286.0893 1296.4450 1365.1594 1382.1605 1391.0338 1393.5618 1420.4432 1424.9613 1448.7102 1469.9403 1476.6811 1489.6331 1508.7775 1575.1374 1602.1563 1613.6694 1625.1055 1629.3021 2997.5216 3098.3812 3101.9154 3125.4755 3158.6328 3161.5395 3179.7229 3184.3177 3185.7982 3187.1334 3538.3288
redmass: 17.3090 7.6004 7.2276 9.0344 8.9800 6.0030 1.3980 3.3821 2.9430 9.8610 6.6761 6.5366 7.4918 6.2381 9.5129 7.9127 4.4240 7.2744 7.9041 5.1868 9.0158 7.3505 9.4675 4.8497 5.0122 3.1697 7.1512 10.2368 4.0773 6.7270 4.4312 5.7464 7.5463 3.7981 1.6764 3.0438 5.4119 5.8080 5.5846 2.4486 6.7887 7.4387 4.8228 6.8266 1.6518 1.4684 7.5574 1.4423 2.3460 2.1310 1.5985 2.9927 1.3620 1.3330 6.0772 7.6943 1.7152 6.5667 8.3410 1.6385 2.9862 1.5491 1.9133 1.3446 1.1250 8.8936 3.1195 2.7804 1.9950 2.4443 1.5245 2.4020 7.2638 6.7042 1.2596 6.0542 3.3587 4.8817 1.0452 1.1455 2.3679 2.9126 2.3369 8.1793 6.3426 6.4260 5.7707 5.7810 1.0364 1.0995 1.0991 1.0895 1.0926 1.0899 1.0937 1.0948 1.0973 1.0933 1.0767
irintensity: 0.2423 2.0356 0.6151 2.4219 1.6129 6.9661 1.3241 1.9911 0.6135 4.0426 0.5372 1.2590 1.7060 0.0062 0.6873 1.8856 1.8945 6.1059 0.9357 1.5573 4.4287 0.4288 1.6751 0.5833 2.1248 12.3296 2.2305 5.0341 15.7201 5.2098 8.0796 5.8919 26.7595 1.5837 45.1607 10.1604 3.8330 11.4235 15.6138 14.5528 8.4310 16.3218 18.9492 32.3813 64.7088 50.3361 9.3334 0.4947 15.8593 8.2590 80.9813 37.6983 1.0534 1.0381 7.2591 179.0227 35.9928 132.4587 212.5937 16.5029 30.0931 13.0308 46.1324 16.2409 4.3315 334.1808 64.0625 153.2472 269.7476 105.5440 173.7438 193.7039 98.0536 5.2700 105.7611 61.1468 150.9398 10.1356 15.9459 5.1672 61.5425 158.1757 286.5672 59.2800 159.6433 91.4072 35.8337 157.5467 10.8623 12.4808 10.2185 11.5143 16.8899 0.6817 14.2612 2.3725 2.4191 9.8335 16.4230
temp: 298.150 k
press: 1.00000 atm
elementType: 9 9 9 8 8 8 8 7 7 6 6 6 6 6 6 6 6 6 6 6 6 6 6 6 1 1 1 1 1 1 1 1 1 1 1
symmnumber: 1
zpe: 627375.5 jmol-1
zpe.correction: 0.238955 hartree
zpe.thermalcorrener: 0.259879 hartree
zpe.thermalcorrenthalpy: 0.260823 hartree
zpe.thermalcorrgfe: 0.185934 hartree
zpe.sumelectzpe: -1286.330613 hartree
zpe.sumelectthermal: -1286.309689 hartree
zpe.sumelectthermalent: -1286.308745 hartree
zpe.sumelectthermalfe: -1286.383634 hartree
dipole: 9.6130 -2.4614 -3.6988
dipole: 10.5900
quadrupole: -110.3572 -148.5457 -140.8027
quadrupole: -9.4439 -0.2730 -9.0989
quadrupole: 22.8780 -15.3105 -7.5675 -9.4439 -0.2730 -9.0989
hfenergy: -1286.5695679 hartree
pointgroup: C01 [X(C15H11F3N2O4)]
dipole: -3.5373163 1.2276454 -1.8274189 debye
polarizability: 264.6697609|4.3776427|217.8316581|33.3227641|-12.8626464|140.6061943 unknown
InChI: InChI=1S/C15H11F3N2O4/c1-9(21)19-11-3-2-4-12(8-11)24-14-6-5-10(15(16,17)18)7-13(14)20(22)23/h2-8,19H,1H3
charge 0 multiplicity 1
35 atoms
F  4.343071 2.217398 -0.407483
F  5.409009 0.384525 0.408099
F  4.981175 0.567667 -1.814747
O  -0.629131 -1.781314 0.168711
O  2.403643 -2.433162 2.853851
O  0.754948 -3.501664 1.693099
O  -2.001087 2.908863 0.557729
N  -3.951255 1.879545 -0.245298
N  1.595181 -2.540074 1.847605
C  0.578975 -1.12672 -0.017854
C  3.110114 0.127267 -0.329451
C  1.687083 -1.4922 0.803269
C  2.93636 -0.855485 0.657669
C  -1.870213 -1.239375 -0.292139
C  0.775728 -0.128444 -1.010049
C  2.02497 0.485654 -1.170079
C  -3.508751 0.541738 -0.440287
C  -2.213438 0.106554 -0.056004
C  4.435201 0.803107 -0.520086
C  -2.757782 -2.169859 -0.864348
C  -4.421811 -0.376158 -1.029593
C  -4.045001 -1.718356 -1.230592
C  -3.220828 2.977098 0.226073
C  -4.010492 4.279187 0.31466
H  3.749805 -1.14344 1.32844
H  -0.059008 0.15931 -1.653294
H  2.158485 1.246033 -1.945703
H  -1.527976 0.812022 0.418018
H  -2.443607 -3.207745 -0.998597
H  -5.423316 -0.039564 -1.324353
H  -4.757495 -2.419398 -1.676606
H  -4.92641 2.058113 -0.494262
H  -5.053625 4.198742 -0.037217
H  -3.492903 5.052652 -0.27796
H  -4.015717 4.623586 1.36328
