program: Gaussian 09
title: 000247033
version: EM64L-G09RevD.01
frameworkgroup: C1[X(C14H17N3S3)]
method: RPBEPBE
basis: SDD
operation: Freq
keyword: #p
keyword: freq=noraman
keyword: PBEPBE/SDD
title: #p freq=noraman PBEPBE/SDD
converged: YES YES NO NO
title: Mulliken charges:
elementType: S S S N N N C C C C C C C C C C C C C C H H H H H H H H H H H H H H H H H
charge: 0.203064 0.266703 0.264264 -0.508613 0.075333 0.072257 0.475372 0.478274 -0.477743 0.484624 -0.464062 -0.416928 -0.363936 -0.465740 -0.187740 -0.820076 -0.473301 -0.815900 -0.820858 -0.825182 0.306783 0.253966 0.228693 0.230140 0.220898 0.231280 0.230116 0.221871 0.290037 0.242740 0.281029 0.275953 0.272504 0.245362 0.272394 0.272303 0.244118
chargesum: 0.00000
title: Mulliken charges with hydrogens summed into heavy atoms:
elementType: S S S N N N C C C C C C C C C C C C C C
charge: 0.203064 0.266703 0.264264 -0.201830 0.075333 0.072257 0.475372 0.478274 -0.223777 0.484624 -0.235370 -0.416928 -0.363936 -0.235600 0.033158 -0.136808 -0.473301 -0.002093 -0.027039 -0.036367
polarizability: 3.36160403e+02 -2.79940463e+00 2.64769409e+02 2.11069538e+01 -7.55270896e+00 1.51563570e+02
1716.lowfreq: -9.2549 -7.8017 -3.4942 -0.0017 0.0015 0.0019 6.2536 23.2488 29.6286
frequency: -6.7936 23.1693 29.6176 34.5191 51.2847 59.6964 73.0568 90.4397 106.7075 114.8954 120.1856 124.8793 129.4527 155.5699 172.5532 195.6104 205.7388 210.8379 233.8254 243.2120 261.6375 288.1274 330.3219 364.9667 372.1166 428.2216 437.9685 463.0864 477.6656 517.1892 534.2578 557.9926 559.0903 607.5229 630.0844 657.0708 659.5286 667.6270 691.6344 714.4524 748.2594 756.2108 775.1512 786.4934 831.2717 868.3007 888.0425 935.1669 965.6964 972.7676 978.4153 980.3912 985.3272 987.7695 991.9388 993.3463 1012.3178 1047.3380 1092.7524 1109.5384 1177.5786 1180.1985 1207.0432 1228.8802 1266.5174 1279.9816 1304.7189 1335.2982 1343.4270 1346.5179 1354.6099 1389.7475 1395.4753 1417.0805 1432.7895 1433.8361 1437.2674 1443.5180 1444.7892 1449.7784 1457.0210 1468.0783 1469.4963 1484.5502 1499.1900 1515.7102 1602.1743 1620.7030 2975.8415 3021.2913 3023.3586 3027.1474 3054.1874 3084.9664 3117.3243 3130.6918 3137.5904 3144.5357 3146.8660 3150.7836 3152.7646 3154.4434 3155.3946 3161.4581 3500.1714
redmass: 1.0440 5.5666 4.1472 4.7621 3.2259 3.5190 3.7544 3.3935 1.2621 3.5016 1.1297 1.4241 4.3236 2.5170 4.7580 6.7808 3.7879 3.2311 4.3002 6.2420 4.0778 4.8240 5.3350 8.3610 4.1713 2.4393 3.8682 2.1066 4.6279 4.9618 8.1696 11.0215 3.9028 8.0838 8.5747 7.3808 7.4608 7.3552 2.2041 5.3417 12.2244 6.2189 2.9313 2.5353 9.8076 1.3181 1.4809 2.4283 1.3410 1.1798 1.1788 1.1831 4.5080 1.3682 1.2675 1.2775 1.6515 1.5626 2.0362 3.3655 1.5008 1.3966 6.1095 7.0830 4.2647 4.5320 1.4396 1.2618 1.2438 1.1602 2.3245 2.7306 1.6471 4.9724 1.0545 1.0537 1.0535 2.7213 1.1002 1.0854 1.0837 1.8468 1.0491 1.3941 5.0730 2.4935 5.4759 6.0514 1.0371 1.0282 1.0281 1.0281 1.0976 1.0987 1.0864 1.0912 1.0913 1.1039 1.1040 1.1057 1.1045 1.0993 1.1055 1.1056 1.0751
irintensity: 0.3583 0.3865 0.0350 0.9254 2.5249 3.3866 0.3227 2.1961 0.5483 1.1217 0.0285 0.3597 1.0558 0.3044 2.7448 2.3393 5.7393 0.2564 0.1982 1.9122 6.5178 10.1027 17.0700 3.3134 0.5804 63.8195 11.1809 59.4104 12.0694 1.1603 1.2391 1.2732 3.3973 8.3359 2.0705 0.0913 0.3408 0.2592 19.7023 13.1116 55.2385 9.1906 17.0720 131.8543 27.1377 1.6551 11.3055 14.5537 0.5182 4.1024 9.9905 5.1576 3.4688 2.2138 5.2731 2.3002 6.9188 11.2394 29.6810 15.9707 3.5344 20.7750 92.1818 74.4347 4.4691 36.2061 5.4596 76.8288 53.1256 7.5175 174.5831 118.0258 78.7007 423.9770 2.6194 15.4783 27.2626 163.7540 27.0965 6.1953 21.7424 65.8636 9.3807 92.0850 53.0357 136.5671 91.3949 131.6716 33.8692 18.4947 28.2704 21.5825 19.0348 23.7557 4.3857 22.8802 18.6390 15.5104 5.5508 14.1898 8.1827 28.6310 10.8308 7.6266 25.8335
temp: 298.150 k
press: 1.00000 atm
elementType: 16 16 16 7 7 7 6 6 6 6 6 6 6 6 6 6 6 6 6 6 1 1 1 1 1 1 1 1 1 1 1 1 1 1 1 1 1
symmnumber: 1
zpe: 738258.0 jmol-1
zpe.correction: 0.281188 hartree
zpe.thermalcorrener: 0.303221 hartree
zpe.thermalcorrenthalpy: 0.304165 hartree
zpe.thermalcorrgfe: 0.227611 hartree
zpe.sumelectzpe: -1900.656872 hartree
zpe.sumelectthermal: -1900.634839 hartree
zpe.sumelectthermalent: -1900.633895 hartree
zpe.sumelectthermalfe: -1900.710448 hartree
dipole: 0.4719 -1.3150 -0.4958
dipole: 1.4825
quadrupole: -139.3198 -122.5820 -138.4661
quadrupole: -3.7610 -1.0087 -4.3550
quadrupole: -5.8638 10.8740 -5.0102 -3.7610 -1.0087 -4.3550
hfenergy: -1900.9380594 hartree
pointgroup: C01 [X(C14H17N3S3)]
dipole: -0.2990505 0.5006916 -0.0072651 debye
polarizability: 328.7393185|23.0977259|253.7571978|-33.4035873|34.9223487|169.9968655 unknown
InChI: InChI=1S/C14H17N3S3/c1-9-6-5-7-10(8-9)15-11-12(18-2)16-14(20-4)17-13(11)19-3/h5-8,15H,1-4H3
charge 0 multiplicity 1
37 atoms
S  -0.308489 -3.284164 -1.09267
S  -0.237661 2.26252 -0.328364
S  -4.59093 -0.773446 1.076715
N  0.943703 -0.537999 -1.15572
N  -2.371587 -1.802493 -0.031952
N  -2.297916 0.584001 0.36756
C  2.14141 -0.043419 -0.57418
C  -0.344213 -0.53772 -0.58203
C  2.22182 0.30655 0.797091
C  3.432172 0.786373 1.354884
C  3.295809 0.073922 -1.3960
C  -1.103092 -1.749225 -0.503093
C  -1.037365 0.635678 -0.150377
C  4.576859 0.897986 0.526948
C  4.503351 0.53482 -0.838771
C  3.490803 1.163219 2.826014
C  -2.90608 -0.627956 0.404848
C  -1.750986 -4.480076 -0.926465
C  -1.659645 3.385179 0.179049
C  -4.923798 1.009732 1.566189
H  1.056163 -1.098902 -2.004896
H  1.341105 0.191135 1.438464
H  3.237957 -0.185991 -2.460076
H  5.519945 1.263664 0.948689
H  5.391865 0.620528 -1.474645
H  2.781434 1.980123 3.057373
H  3.222066 0.306311 3.472144
H  4.500932 1.499913 3.115724
H  -2.087121 -4.50196 0.118781
H  -1.354617 -5.458314 -1.239676
H  -2.576824 -4.159725 -1.576304
H  -1.954145 3.170136 1.215107
H  -2.515559 3.23361 -0.493358
H  -1.261882 4.407968 0.085939
H  -4.885989 1.655189 0.677669
H  -4.178293 1.340016 2.303127
H  -5.933602 1.008619 2.005859
