program: Gaussian 09
title: 000246994
version: EM64L-G09RevD.01
frameworkgroup: C1[X(C9H8N2OS)]
method: RPBEPBE
basis: SDD
operation: Freq
keyword: #p
keyword: freq=noraman
keyword: PBEPBE/SDD
title: #p freq=noraman PBEPBE/SDD
converged: YES YES NO NO
title: Mulliken charges:
elementType: S O N N C C C C C C C C C H H H H H H H H
charge: 0.346190 -0.241857 -0.431830 0.002385 0.488615 -0.437371 -0.346711 0.269985 -0.196460 -0.212048 -0.249702 -0.814562 -0.359341 0.329939 0.236862 0.305043 0.231029 0.229291 0.314115 0.304724 0.231704
chargesum: 0.00000
title: Mulliken charges with hydrogens summed into heavy atoms:
elementType: S O N N C C C C C C C C C
charge: 0.346190 -0.241857 -0.101891 0.002385 0.488615 -0.200509 -0.041668 0.269985 0.034569 0.017243 -0.017998 -0.195723 -0.359341
polarizability: 1.72436751e+02 1.03633689e+01 1.47940052e+02 -4.14632079e+00 6.36891644e+00 6.48001419e+01
1716.lowfreq: -12.1755 -5.5867 0.0011 0.0014 0.0020 4.7363 26.9037 51.5727 51.9120
frequency: 26.7562 51.5469 51.8875 74.9731 121.0071 151.2960 185.6500 266.7220 329.8595 343.1676 380.6375 407.6470 442.3592 467.9102 512.5120 557.5661 612.6312 627.7731 664.4157 683.2122 698.2482 710.3167 773.7468 820.2495 848.8062 903.9331 924.5357 931.0458 978.3014 985.5937 1000.8240 1027.1110 1091.1815 1130.4869 1174.0212 1191.7568 1217.8369 1242.2641 1262.5742 1326.0097 1386.5470 1416.3694 1432.2198 1484.5125 1524.7626 1603.6744 1613.2000 1618.8609 2088.8761 3047.7054 3116.0874 3135.1241 3146.1537 3148.3038 3167.7749 3197.6777 3481.3739
redmass: 5.3542 7.9504 8.7657 6.1063 9.2724 4.5520 5.5763 4.0502 5.7653 4.7744 12.5547 2.9209 6.0335 5.6707 3.0316 5.4152 6.3946 14.6429 4.0352 1.2726 2.0865 5.5398 1.6686 4.4153 1.2584 2.1989 1.4410 6.1508 1.3617 6.1173 1.3110 2.1425 1.5618 1.1979 1.0542 1.1164 2.8183 1.2052 2.0756 1.4349 7.5022 1.1111 2.2510 2.3654 2.0079 5.8783 5.2167 5.1549 12.7221 1.0600 1.0892 1.0870 1.1063 1.0934 1.0999 1.0952 1.0774
irintensity: 5.0936 2.9895 2.4891 5.1022 4.8336 3.2838 5.8206 1.2613 0.9426 1.8598 0.1647 0.0055 4.9594 12.8993 25.3296 13.1107 0.2118 1.5268 5.5235 30.8230 62.3993 11.2637 103.2351 3.5243 0.5221 4.5071 16.5783 0.3378 0.1231 0.0411 2.7326 6.0222 16.6301 26.8679 0.6026 0.6342 5.5723 4.5754 23.0698 27.1432 26.3885 40.4613 47.7159 62.9531 208.7569 87.9377 33.1544 129.8642 24.5002 4.7799 9.1376 1.1542 0.4721 24.8464 22.6606 5.2036 33.4538
temp: 298.150 k
press: 1.00000 atm
elementType: 16 8 7 7 6 6 6 6 6 6 6 6 6 1 1 1 1 1 1 1 1
symmnumber: 1
zpe: 399598.2 jmol-1
zpe.correction: 0.152199 hartree
zpe.thermalcorrener: 0.164517 hartree
zpe.thermalcorrenthalpy: 0.165461 hartree
zpe.thermalcorrgfe: 0.111345 hartree
zpe.sumelectzpe: -929.603112 hartree
zpe.sumelectthermal: -929.590793 hartree
zpe.sumelectthermalent: -929.589849 hartree
zpe.sumelectthermalfe: -929.643965 hartree
dipole: -0.2488 -0.1030 1.0974
dipole: 1.1299
quadrupole: -71.4497 -92.9288 -84.3375
quadrupole: 8.1108 -3.4689 -0.8497
quadrupole: 11.4557 -10.0235 -1.4322 8.1108 -3.4689 -0.8497
hfenergy: -929.7553104 hartree
pointgroup: C01 [X(C9H8N2O1S1)]
dipole: 0.1007154 0.0216416 -0.4324492 debye
dipolederiv: -0.0450806 0.0039511 0.0955894 -0.2411235 -0.1755202 -0.1086982 -0.044549 -0.0779048 0.1496271 -0.4919064 -0.2690813 -0.0259717 0.4581657 -1.0049488 -0.0732116 0.0437457 0.1009746 -0.297853 -1.2162095 0.3358531 0.0777977 0.630661 -0.6486429 -0.0556479 0.1173512 -0.0343476 -0.2922601 -0.2314217 0.0440125 -0.0087839 -0.0623 -0.3864717 -0.021984 -0.0125343 0.0245205 -0.1928233 0.9494836 -0.1953315 -0.1231811 -0.0832427 0.0570088 0.0148697 -0.1548158 0.0350515 0.1161217 -0.1552669 0.0597483 -0.0115191 0.164699 -0.0403086 -0.0270534 0.0052264 0.0022326 -0.1907175 -0.2389873 0.0018157 0.0024053 -0.0729685 -0.0513291 0.0174397 0.013056 -0.0035326 -0.1641822 1.0617775 0.0907388 -0.0143077 -0.9319335 1.3612694 0.0359349 -0.1547846 -0.1469802 0.0597947 0.0032711 -0.0122532 -0.0310309 -0.1077464 0.1537431 0.0169753 -0.0330299 0.0080253 -0.1321061 0.0646184 0.0659084 -0.0377552 0.1354745 0.1067056 -0.0155113 -0.0445845 -0.0136837 -0.1375726 0.0035077 -0.0135764 -0.0416193 -0.0118683 -0.1210676 0.0053856 -0.0327483 0.0027714 -0.1673119 0.0994573 0.0595941 0.0618077 0.1780194 0.1373254 0.177735 0.2438942 0.1394806 0.2177573 -0.1530626 -0.119726 -0.0679245 0.0341317 0.3865055 -0.0192292 -0.1249235 -0.0308667 -0.1344864 0.2349098 0.0451845 0.0536684 0.0083947 0.1155875 0.0154302 0.0857838 0.0032378 0.2851198 -0.0120073 -0.1071479 0.0342206 -0.0927191 0.0177468 0.0122322 0.033841 0.0097274 0.1603758 0.1626974 0.0484324 0.0131539 0.0130726 0.0500962 -0.0025133 0.0152984 -0.0059768 0.1800157 0.0569748 0.0568449 0.016302 0.0810921 -0.0924275 -0.0142875 0.0186848 -0.0138351 0.1546837 -0.0071022 -0.0859276 0.0259635 -0.1112941 -0.0308656 0.0172478 0.0285325 0.0145089 0.1495404 0.0419286 -0.02574 -0.02534 0.0589129 0.0304962 -0.0275128 -0.0537761 -0.0343714 0.1060218 -0.0110924 -0.0186256 -0.0435077 -0.0837868 0.0480744 0.0592545 -0.0046035 0.0274379 -0.0285395 -0.1164891 0.0353258 0.0500328 0.0363592 0.0870232 -0.0068556 0.0549357 -0.0064696 0.1587946 unknown
polarizability: 171.9370719|-10.3233295|148.5205017|-4.9328919|6.2831933|64.7193705 unknown
InChI: InChI=1S/C9H8N2OS/c10-7-13-6-9(12)11-8-4-2-1-3-5-8/h1-5,11H,6H2
charge 0 multiplicity 1
21 atoms
S  3.435978 -0.184372 0.663576
O  0.480923 -2.392823 -0.372209
N  0.211326 -0.051925 -0.423147
N  2.537028 2.583858 0.237475
C  -1.184762 0.10191 -0.160751
C  -1.67534 1.431983 -0.059581
C  -2.071065 -0.996592 -0.00596
C  0.950967 -1.222115 -0.49095
C  -3.041701 1.663462 0.192861
C  -3.437116 -0.744931 0.248123
C  -3.932364 0.575084 0.348266
C  2.44617 -1.0235 -0.773847
C  2.912964 1.455563 0.404662
H  0.725457 0.829709 -0.525627
H  -0.986723 2.279854 -0.169662
H  -1.68858 -2.015579 -0.082747
H  -3.408744 2.692455 0.271178
H  -4.118872 -1.594198 0.368161
H  2.917207 -2.013559 -0.859339
H  2.644215 -0.4268 -1.679423
H  -4.994367 0.755017 0.545541
