program: Gaussian 09
title: 000247007
version: EM64L-G09RevD.01
frameworkgroup: C1[X(C18H20O2)]
method: RPBEPBE
basis: SDD
operation: Freq
keyword: #pfreq=noraman
keyword: PBEPBE/SDD
title: #p freq=noraman PBEPBE/SDD
converged: YES YES NO NO
title: Mulliken charges:
elementType: O O C C C C C C C C C C C C C C C C C C H H H H H H H H H H H H H H H H H H H H
charge: -0.201282 -0.223279 -0.273960 0.350075 0.188865 0.125490 0.373749 -0.565962 -0.451211 -0.691851 -0.512955 -0.594345 -0.400452 -0.525550 -0.509483 -0.176942 0.195270 0.166228 -0.311186 -0.686505 0.222029 0.217241 0.223317 0.218668 0.230535 0.266094 0.245858 0.247212 0.253199 0.225352 0.233098 0.250550 0.249240 0.250021 0.243274 0.235258 0.248149 0.219247 0.225165 0.221777
chargesum: 0.00000
title: Mulliken charges with hydrogens summed into heavy atoms:
elementType: O O C C C C C C C C C C C C C C C C C C
charge: -0.201282 -0.223279 -0.051931 0.350075 0.188865 0.125490 0.373749 -0.116759 -0.010653 -0.179898 -0.012544 -0.135895 -0.149902 -0.026289 -0.266209 0.058316 0.195270 0.166228 -0.063037 -0.020316
polarizability: 2.66047545e+02 9.37286045e+00 1.88107878e+02 -1.59827089e+00 -1.74281100e+00 1.35884855e+02
1716.lowfreq: -10.2225 -4.6188 0.0001 0.0008 0.0011 3.9105 31.4147 40.1082 41.9575
frequency: 31.3875 40.0896 41.9473 75.8062 88.5240 103.4340 126.2605 149.2559 156.6015 205.1056 213.5306 219.5534 267.7398 300.4397 312.5559 326.6696 379.4829 387.6661 405.2523 421.0560 456.1515 470.4704 483.7354 500.2708 505.3864 530.0517 564.3131 585.3499 596.1634 648.3843 671.6633 700.1657 722.1372 750.3776 759.3730 776.1037 784.6902 820.7011 827.5497 849.4667 859.3903 878.5044 895.8313 944.6726 948.3050 965.1538 976.6790 988.8619 1006.0156 1009.9561 1023.2222 1047.8695 1064.4965 1081.1662 1092.8027 1116.4926 1125.6801 1155.0926 1164.8208 1179.5502 1182.1930 1193.8285 1210.8625 1228.0022 1239.2216 1243.8831 1247.7192 1255.7986 1269.6963 1290.8013 1298.7633 1306.7038 1314.0042 1324.0128 1332.6226 1353.8724 1375.1659 1377.5882 1388.1632 1418.3599 1423.0341 1435.1833 1440.1369 1462.4267 1467.5812 1469.8182 1475.8303 1484.7272 1509.8039 1586.0605 1589.5524 1604.3440 1626.9624 1635.5148 2933.6188 2964.5550 2978.5749 2979.7573 2982.9208 2983.5158 2995.0178 3010.4028 3049.1471 3052.5629 3057.4977 3067.5733 3069.0548 3075.8774 3077.3432 3080.6389 3100.2076 3123.5916 3145.1634 3146.8681
redmass: 7.3367 8.0501 4.3785 3.3326 3.3523 3.0104 3.3996 4.0668 3.3655 1.6709 1.3804 3.7039 2.3776 3.5360 2.4458 3.0209 3.6618 3.2616 3.2863 3.2352 3.7566 3.5597 3.8913 3.2486 3.4685 4.0253 2.7502 3.5417 3.8359 3.5640 3.5765 3.3334 2.3882 2.3879 2.3910 2.1966 2.6642 2.5082 1.4015 1.9172 2.3718 1.6685 2.3843 2.6318 2.4289 1.4064 2.3641 2.0260 1.3636 2.2606 2.1126 2.6841 1.9221 1.6013 2.1978 1.2622 1.2378 1.6351 1.5261 1.2467 1.6571 2.9494 1.4070 1.5171 1.6750 1.5926 1.7977 1.7091 1.4841 1.4358 1.5257 1.6683 1.6677 1.4654 1.6632 1.4513 1.8376 3.4510 1.2294 1.4792 1.0863 2.0132 1.0829 1.7640 1.1076 1.1244 1.2754 1.0576 1.1028 7.4942 8.4353 7.1352 6.9193 10.7643 1.0683 1.0707 1.0351 1.0698 1.0685 1.0633 1.0699 1.0621 1.0986 1.1004 1.0962 1.0961 1.0902 1.0940 1.0992 1.0981 1.0873 1.0873 1.0968 1.0962
irintensity: 4.3910 3.5569 0.4615 2.4044 0.4101 0.1488 3.2239 4.2082 0.3118 0.4064 0.2026 3.1179 0.7291 1.0166 1.3143 0.2682 1.1868 3.6075 16.3063 7.8189 4.9969 0.6969 0.7006 2.0368 3.3304 1.4135 5.9826 3.2967 1.7764 1.8895 6.8298 1.1766 1.6243 4.9940 1.7409 2.4877 1.8155 9.6106 22.0601 41.4004 2.1751 11.1825 6.4619 5.2032 11.2857 1.1630 6.7100 4.7635 0.1671 4.8778 3.3095 3.1640 5.7645 0.7765 6.2534 6.0218 17.9745 30.5344 19.6950 8.4293 29.4122 3.5957 6.5666 10.3659 6.6126 6.4080 7.5648 32.4108 7.2327 1.5166 2.8525 5.0659 1.9285 3.3499 11.2429 1.1336 17.0536 1.0726 12.3132 14.1309 1.8899 21.6346 16.4171 19.1221 3.5139 22.9162 15.0611 0.1796 14.1832 40.3410 108.2139 7.2436 154.2119 199.2824 17.3602 21.2006 34.7393 10.1543 5.3068 13.4134 38.4848 24.3155 13.4545 29.2469 19.6437 21.8156 10.6555 18.4443 60.4324 47.6641 10.0311 7.8939 13.1412 14.1589
temp: 298.150 k
press: 1.00000 atm
elementType: 8 8 6 6 6 6 6 6 6 6 6 6 6 6 6 6 6 6 6 6 1 1 1 1 1 1 1 1 1 1 1 1 1 1 1 1 1 1 1 1
symmnumber: 1
zpe: 871572.6 jmol-1
zpe.correction: 0.331964 hartree
zpe.thermalcorrener: 0.350104 hartree
zpe.thermalcorrenthalpy: 0.351048 hartree
zpe.thermalcorrgfe: 0.285137 hartree
zpe.sumelectzpe: -846.898802 hartree
zpe.sumelectthermal: -846.880663 hartree
zpe.sumelectthermalent: -846.879719 hartree
zpe.sumelectthermalfe: -846.945630 hartree
dipole: 1.2937 4.3461 -0.6095
dipole: 4.5753
quadrupole: -167.6449 -116.3511 -114.6152
quadrupole: -1.2157 -11.2320 -0.2490
quadrupole: -34.7745 16.5193 18.2552 -1.2157 -11.2320 -0.2490
hfenergy: -847.2307668 hartree
pointgroup: C01 [X(C18H20O2)]
dipole: 0.4881918 -1.7008202 0.3302998 debye
polarizability: 265.5824476|-11.0639422|188.0763736|-3.2993963|-4.7007669|136.3814576 unknown
InChI: InChI=1S/C18H20O2/c1-2-16-17(12-3-6-14(19)7-4-12)9-5-13-11-15(20)8-10-18(13)16/h3,5-6,9,12H,2,4,7-8,10-11H2,1H3
charge 0 multiplicity 1
40 atoms
O  5.425247 1.359501 -0.890065
O  -5.434639 1.638556 0.436937
C  -2.070089 -0.905844 -0.288855
C  -0.674571 -0.247802 -0.22715
C  1.735449 -0.338289 0.27717
C  0.470469 -0.991609 0.206361
C  1.857256 1.042834 -0.049634
C  3.030432 -1.042007 0.677003
C  -2.810667 -0.867774 1.086964
C  3.212917 1.715795 0.087788
C  4.183827 -0.659126 -0.28452
C  0.353677 -2.474758 0.557457
C  -0.528274 1.119896 -0.564616
C  -3.466602 0.503192 1.361959
C  0.722605 1.762953 -0.474747
C  -2.943772 -0.307391 -1.376979
C  4.377385 0.852059 -0.414257
C  -4.409231 0.922133 0.231518
C  -4.030433 0.48672 -1.137225
C  0.641505 -3.402627 -0.654768
H  -1.924809 -1.970496 -0.55971
H  -2.105792 -1.115535 1.901558
H  -3.597634 -1.647652 1.083328
H  3.312781 -0.747233 1.709918
H  2.92032 -2.137969 0.686529
H  3.250732 2.696761 -0.414904
H  3.425853 1.907928 1.16455
H  3.963896 -1.044828 -1.301362
H  5.146135 -1.109516 0.019716
H  1.049534 -2.727219 1.377931
H  -0.653618 -2.700836 0.948708
H  -1.400994 1.683506 -0.91171
H  -2.684883 1.284894 1.455329
H  -4.032901 0.501952 2.309655
H  0.814573 2.823034 -0.737423
H  -2.664448 -0.542178 -2.414126
H  -4.658693 0.861866 -1.954335
H  -0.061761 -3.20467 -1.484395
H  0.545887 -4.466586 -0.37066
H  1.662532 -3.242731 -1.046535
