program: Gaussian 09
title: 000246991
version: EM64L-G09RevD.01
frameworkgroup: C1[X(C6H14S2)]
method: RPBEPBE
basis: SDD
operation: Freq
keyword: #pfreq=noraman
keyword: PBEPBE/SDD
title: #p freq=noraman PBEPBE/SDD
converged: NO YES NO NO
title: Mulliken charges:
elementType: S S C C C C C C H H H H H H H H H H H H H H
charge: 0.154617 0.154617 -0.321934 -0.321934 -0.672451 -0.672451 -0.842489 -0.842488 0.211703 0.211695 0.211693 0.211705 0.248595 0.248577 0.248587 0.248584 0.253494 0.254091 0.254102 0.254095 0.253494 0.254098
chargesum: 0.00000
title: Mulliken charges with hydrogens summed into heavy atoms:
elementType: S S C C C C C C
charge: 0.154617 0.154617 0.101464 0.101464 -0.175280 -0.175280 -0.080802 -0.080802
polarizability: 1.49054350e+02 3.15225669e+00 8.70968671e+01 -2.67263601e-03 -3.15125235e-04 6.63954524e+01
1716.lowfreq: -0.0027 -0.0014 0.0019 4.1654 4.4730 29.6158 33.0548 46.6414 60.9601
frequency: 33.0548 46.6414 60.3335 64.9565 116.2612 123.7526 143.6485 166.6580 168.3043 194.8466 225.1958 372.6137 380.8755 663.2573 665.2617 698.5482 718.7325 750.2838 781.5506 881.3384 964.1575 965.3552 970.3642 975.9298 1027.2290 1037.0110 1045.4348 1078.4217 1082.9444 1219.8189 1228.4014 1255.9490 1284.3074 1293.2407 1311.1985 1341.3562 1348.9720 1354.4503 1449.6637 1449.6781 1453.5696 1455.9290 1463.2390 1463.6212 1471.9882 1485.8905 2978.8084 2985.2614 2994.9685 2995.5930 2997.5043 3000.0917 3023.8655 3043.7669 3069.3786 3078.4871 3106.8595 3106.8943 3124.1455 3124.1525
redmass: 3.1302 4.1011 2.3401 3.7741 2.0114 2.0139 3.3432 1.0590 1.1296 8.7314 3.5225 3.4927 4.5401 6.9355 6.8392 5.1673 5.9586 1.0680 1.1452 1.2591 1.4370 1.1733 1.1801 1.3449 1.2717 3.4307 3.2379 2.7874 1.0357 1.1883 1.4046 1.2173 1.1799 1.0569 1.2829 1.2527 1.1528 1.3362 1.0534 1.0534 1.0855 1.0852 1.0543 1.0574 1.0712 1.0981 1.0592 1.0584 1.0400 1.0309 1.0447 1.0536 1.1008 1.1050 1.1096 1.1080 1.1056 1.1056 1.1023 1.1023
irintensity: 2.0373 7.5364 0.0001 2.4200 0.0321 0.0000 0.0000 0.6177 0.0000 0.0000 0.3373 0.0000 5.7831 0.0000 2.3560 5.7245 0.0000 13.5063 0.0000 0.6870 0.0000 0.0000 15.8372 17.3525 0.0000 5.8260 0.0000 0.0000 1.2735 10.7920 0.0000 0.0000 0.6570 0.0000 44.5995 0.0000 1.5446 0.0000 0.0351 32.0413 11.5227 0.0000 22.2933 0.0000 0.0000 11.4055 0.0000 5.7285 0.0000 112.8811 0.0000 67.2051 0.0000 2.6745 0.0000 114.7413 0.0709 46.3041 9.4324 15.8304
temp: 298.150 k
press: 1.00000 atm
elementType: 16 16 6 6 6 6 6 6 1 1 1 1 1 1 1 1 1 1 1 1 1 1
symmnumber: 1
zpe: 492646.2 jmol-1
zpe.correction: 0.187639 hartree
zpe.thermalcorrener: 0.200012 hartree
zpe.thermalcorrenthalpy: 0.200956 hartree
zpe.thermalcorrgfe: 0.146790 hartree
zpe.sumelectzpe: -1032.464742 hartree
zpe.sumelectthermal: -1032.452369 hartree
zpe.sumelectthermalent: -1032.451425 hartree
zpe.sumelectthermalfe: -1032.505590 hartree
dipole: 0.0000 0.0000 0.0016
dipole: 0.0016
quadrupole: -61.6954 -67.7338 -67.7799
quadrupole: 13.1575 -0.0014 -0.0001
quadrupole: 4.0410 -1.9974 -2.0435 13.1575 -0.0014 -0.0001
hfenergy: -1032.6523807 hartree
pointgroup: C01 [X(C6H14S2)]
dipole: 0.0000003 0.0000012 -0.0006297 debye
dipolederiv: -0.2861133 0.0168384 0.0000282 -0.009944 -0.0119205 0.0004015 -0.0000132 0.0003198 -0.1996331 -0.286112 0.016839 -0.0000065 -0.0099422 -0.0119202 0.0002236 -0.0000238 0.0002172 -0.1996333 -0.1219355 0.0213904 -0.0000352 -0.0768665 0.0772568 -0.00014 -0.0002132 -0.0001129 0.1681683 -0.1219345 0.0213904 -0.000059 -0.0768664 0.0772577 -0.0001432 -0.0001741 -0.0000942 0.1681689 0.2905048 0.1578422 0.0002864 0.1221241 0.0659657 -0.0002263 0.0002125 -0.0001803 0.1746362 0.2905036 0.1578426 0.0002296 0.1221242 0.0659649 -0.0000775 0.0001897 -0.0000735 0.1746364 0.0577348 -0.1267171 -0.0002514 -0.1272147 0.0416707 -0.0001299 -0.0002463 -0.000074 0.082796 0.0577342 -0.126717 -0.0001397 -0.1272153 0.0416711 -0.0001042 -0.0001354 -0.0000933 0.0827962 0.0729897 0.0013201 -0.0111912 0.0150231 -0.0189343 0.1069265 -0.0150212 0.1114539 -0.0634806 0.0730122 0.0013022 0.0112429 0.0150142 -0.0183453 -0.106793 0.0150983 -0.111324 -0.064043 0.0730023 0.0013319 0.0112605 0.0150321 -0.0183723 -0.1067984 0.0151189 -0.1113325 -0.0640234 0.0729993 0.0012903 -0.0111736 0.0150049 -0.0189074 0.106921 -0.0150004 0.1114455 -0.0635005 -0.0274939 -0.0386611 0.0003234 -0.0474667 -0.0545629 0.1096673 -0.0079502 0.1183821 -0.0576645 -0.0274948 -0.038521 -0.0003677 -0.0473763 -0.0537981 -0.1096578 0.007852 -0.1184034 -0.0584195 -0.0275033 -0.0385529 -0.0003834 -0.0473977 -0.053902 -0.1096746 0.007853 -0.1183996 -0.0583154 -0.0274856 -0.0386297 0.0003083 -0.0474461 -0.054459 0.1096513 -0.0079486 0.1183865 -0.0577688 -0.1271239 -0.0604018 -0.0000927 -0.0523278 0.0572252 -0.0001017 -0.0000696 -0.0001147 0.1296742 0.0479771 0.032814 -0.0263674 0.1044638 -0.0418354 -0.1220085 0.00856 -0.1127559 -0.0564516 0.0479419 0.0327936 0.0264132 0.1045705 -0.0427223 0.1220568 -0.0082284 0.1127946 -0.0555827 0.0479723 0.0328546 -0.0263395 0.1045295 -0.0420203 -0.1219888 0.0085263 -0.1127521 -0.0562735 -0.1271237 -0.0604015 -0.0001266 -0.0523272 0.0572254 -0.0000817 -0.0001246 -0.000089 0.1296743 0.0479481 0.0327526 0.0264415 0.1045045 -0.0425376 0.1220775 -0.0082618 0.1127996 -0.0557608 unknown
polarizability: 149.1946392|-1.1067411|86.9565221|0.0161435|0.0325924|66.3955078 unknown
InChI: InChI=1S/C6H14S2/c1-7-5-3-4-6-8-2/h3-6H2,1-2H3
charge 0 multiplicity 1
22 atoms
S  3.422917 0.795148 -0.004805
S  -3.423109 -0.795286 -0.009143
C  0.627188 0.454374 -0.006421
C  -0.627379 -0.454513 -0.007883
C  1.927488 -0.370536 -0.007245
C  -1.92768 0.370398 -0.007256
C  4.791399 -0.497097 -0.007419
C  -4.79159 0.496963 -0.008054
H  0.61136 1.114405 -0.896184
H  0.610962 1.112037 0.88509
H  -0.611105 -1.112278 -0.899318
H  -0.6116 -1.114442 0.881957
H  1.989785 -1.01018 0.892026
H  1.990503 -1.00725 -0.908544
H  -1.990606 1.00748 0.893789
H  -1.990063 1.009675 -0.906782
H  5.745781 0.053133 -0.00658
H  4.728649 -1.123064 -0.912795
H  4.728994 -1.126412 0.895656
H  -4.729206 1.123635 0.896859
H  -5.745972 -0.053265 -0.008853
H  -4.728815 1.125575 -0.911594
