program: Gaussian 09
title: 000246989
version: EM64L-G09RevD.01
frameworkgroup: C1[X(C6H11ClO2)]
method: RPBEPBE
basis: SDD
operation: Freq
keyword: #p
keyword: freq=noraman
keyword: PBEPBE/SDD
title: #p freq=noraman PBEPBE/SDD
converged: YES YES NO NO
title: Mulliken charges:
elementType: Cl O O C C C C C C H H H H H H H H H H H
charge: -0.073095 -0.278876 -0.227163 -0.167108 -0.584412 -0.664691 0.275093 -0.259919 -0.662830 0.241127 0.264833 0.293937 0.234841 0.206428 0.245501 0.224140 0.237683 0.219213 0.250174 0.225125
chargesum: 0.00000
title: Mulliken charges with hydrogens summed into heavy atoms:
elementType: Cl O O C C C C C C
charge: -0.073095 -0.278876 -0.227163 0.074019 -0.025642 0.022080 0.275093 0.201903 0.031682
polarizability: 8.81213488e+01 -3.37278927e+00 7.50022081e+01 1.72715876e+00 9.85542470e-01 7.27523836e+01
1716.lowfreq: -17.5773 -0.0024 -0.0018 0.0009 3.6643 13.3924 38.1863 51.7617 77.4477
frequency: 38.0158 51.6727 77.4310 105.8132 171.7195 180.5994 195.4890 237.9942 296.5272 322.4976 395.9423 431.7962 487.3658 568.8720 613.4863 730.5347 763.1058 816.8264 836.2694 889.6619 931.1563 1010.3769 1020.8074 1066.9392 1095.9373 1124.2567 1130.1273 1158.1719 1193.1165 1249.4008 1278.5143 1307.8424 1315.9149 1356.8522 1390.5922 1398.3294 1437.2489 1457.3574 1464.5411 1468.6048 1478.0395 1485.1708 1647.6766 2955.9108 2992.8473 3001.9581 3031.3868 3066.3071 3087.7461 3093.8843 3099.2261 3114.7757 3120.0124 3156.0921
redmass: 4.9191 4.7075 4.3284 3.9931 3.5391 1.8024 1.1300 1.4298 2.4472 3.2601 2.8960 4.8454 3.4913 4.2769 5.9397 3.7444 2.2030 1.5367 3.0013 1.8486 1.8434 2.2042 1.6541 1.6763 2.1557 2.4599 1.7227 1.6675 1.3560 1.5708 1.1167 1.4616 1.5629 1.2994 1.2321 1.2040 1.0926 1.0930 1.0435 1.0443 1.0545 1.0514 9.8188 1.0803 1.0360 1.0368 1.0595 1.0576 1.0975 1.1031 1.0995 1.1001 1.1064 1.1106
irintensity: 0.6974 1.8770 0.6603 2.1155 1.7129 1.7558 0.7766 0.2999 0.2917 18.6595 5.2568 8.3587 7.4552 6.0710 12.8183 8.4885 18.5737 2.9341 13.0566 6.0625 14.8598 13.3385 32.5885 78.8242 31.9330 243.4942 32.7755 11.8956 4.5473 2.6018 3.0278 16.8870 24.5121 1.1033 24.8398 26.2450 12.9326 10.2288 14.3475 14.2002 11.0139 14.4936 156.9985 9.5390 19.0848 22.8051 25.8089 23.0503 33.5041 1.3496 23.7930 14.0964 31.4129 7.1206
temp: 298.150 k
press: 1.00000 atm
elementType: 17 8 8 6 6 6 6 6 6 1 1 1 1 1 1 1 1 1 1 1
symmnumber: 1
zpe: 427059.3 jmol-1
zpe.correction: 0.162658 hartree
zpe.thermalcorrener: 0.173679 hartree
zpe.thermalcorrenthalpy: 0.174623 hartree
zpe.thermalcorrgfe: 0.124600 hartree
zpe.sumelectzpe: -845.019015 hartree
zpe.sumelectthermal: -845.007994 hartree
zpe.sumelectthermalent: -845.007050 hartree
zpe.sumelectthermalfe: -845.057073 hartree
dipole: 1.4831 0.1141 2.9267
dipole: 3.2830
quadrupole: -57.0566 -62.3217 -62.2290
quadrupole: -6.5418 -2.8976 3.0610
quadrupole: 3.4792 -1.7859 -1.6933 -6.5418 -2.8976 3.0610
hfenergy: -845.181673 hartree
pointgroup: C01 [X(C6H11Cl1O2)]
dipole: -0.4965006 -0.6546657 -0.9965924 debye
dipolederiv: -0.2438745 0.0372124 -0.1001419 0.0143597 -0.2064587 -0.001285 -0.1583327 0.07432 -0.5172657 -1.3633803 -0.3686422 0.0911361 -0.4767252 -0.7573333 0.0226932 0.2101277 0.0342013 -0.3414219 -0.6212892 0.1505176 0.0822419 -0.1940585 -0.8808872 -0.0575338 0.0681924 -0.2107124 -0.3197992 -0.1296648 0.0869121 0.0284777 0.1229396 -0.0165158 -0.0625021 0.0634506 0.0191908 -0.044295 0.2128325 -0.069423 0.1848776 -0.1235146 0.1601913 0.0061295 0.2524452 -0.049261 0.7008874 -0.0084305 -0.0378796 -0.0330534 -0.0109962 -0.0517896 0.0003675 -0.0055813 0.0261851 0.0537918 1.3438738 0.1600359 -0.1889899 0.6214433 1.2681924 0.1085928 -0.2450846 0.2354389 0.2685662 0.8483344 0.0932183 -0.0300164 -0.0363152 0.2543816 -0.0083584 -0.1480544 -0.0980216 0.3126878 -0.1446983 0.0193633 -0.0594409 0.0559899 0.0147853 0.0486366 -0.0404803 0.0933555 -0.0433173 0.0350926 -0.016783 -0.0728567 0.0020228 0.0308441 -0.0041635 -0.0567583 -0.0574704 -0.0677318 -0.0904631 0.0803943 0.0417371 0.0548838 0.086942 -0.023221 0.0285393 -0.0305957 -0.0690161 0.0830304 -0.1067756 -0.0359655 -0.0835645 -0.0143614 0.0073198 -0.0340306 0.0023029 -0.0264516 0.0703876 0.0806293 -0.064575 0.0456297 -0.0485032 0.0946422 -0.0503389 0.0805813 0.0524538 -0.1186666 0.0165615 0.1090304 0.057619 0.0653151 -0.056463 0.1136547 -0.02512 0.0379317 0.0941773 -0.0199245 -0.0123 -0.0288689 0.0917569 -0.0205723 -0.0613334 -0.0735275 -0.0573173 -0.0154511 -0.0245428 0.0113364 -0.0414737 -0.0921305 0.1061423 0.0298464 0.0720053 0.0564397 -0.0114467 -0.034114 -0.0488622 0.0445366 0.0428918 -0.1158629 0.0139584 -0.0410066 -0.0467404 -0.1553175 0.0041254 0.0810035 0.0217687 0.1231543 0.0010763 0.0805978 -0.007498 0.0516872 0.107605 -0.0726915 0.0205194 -0.0387885 -0.0696382 0.0756719 -0.0090887 0.0522053 0.0619887 0.1073491 0.021806 -0.0041583 -0.0068877 -0.000837 -0.1213102 -0.0517293 -0.0965731 -0.0630782 unknown
polarizability: 88.6256605|2.4262696|72.5451896|1.2236274|-0.819131|74.7050904 unknown
InChI: InChI=1S/C6H11ClO2/c1-3-9-6(8)5(2)4-7/h5H,3-4H2,1-2H3
charge 0 multiplicity 1
20 atoms
Cl 2.225091 -0.950446 1.704076
O  -0.996346 -0.710381 -0.068737
O  -0.483241 1.536053 0.296589
C  1.189946 0.029927 -0.758183
C  1.794328 -1.231707 -0.119593
C  2.149439 1.234136 -0.785476
C  -0.153627 0.402886 -0.114176
C  -2.346136 -0.504912 0.546306
C  -3.344383 0.013054 -0.492344
H  0.949655 -0.270885 -1.802559
H  2.745467 -1.50667 -0.599521
H  1.085128 -2.070117 -0.117983
H  1.678918 2.09596 -1.286778
H  3.077618 0.97239 -1.324703
H  2.412004 1.54294 0.239622
H  -2.614669 -1.506153 0.919028
H  -2.239453 0.200069 1.389171
H  -4.35143 0.077291 -0.039851
H  -3.060052 1.020091 -0.840432
H  -3.400058 -0.666026 -1.360758
