program: Gaussian 09
title: 000246988
version: EM64L-G09RevD.01
frameworkgroup: C1[X(C6H10N2O2)]
method: RPBEPBE
basis: SDD
operation: Freq
keyword: #p
keyword: freq=noraman
keyword: PBEPBE/SDD
title: #p freq=noraman PBEPBE/SDD
converged: YES YES NO NO
title: Mulliken charges:
elementType: O O N N C C C C C C H H H H H H H H H H
charge: -0.429973 -0.237323 -0.410859 -0.020664 -0.333915 -0.414778 0.208547 0.186707 -0.332812 -0.770566 0.260318 0.244557 0.199705 0.278493 0.175451 0.340882 0.257528 0.232744 0.237489 0.328468
chargesum: 0.00000
title: Mulliken charges with hydrogens summed into heavy atoms:
elementType: O O N N C C C C C C
charge: -0.101505 -0.237323 -0.069977 -0.020664 -0.073596 0.029484 0.208547 0.186707 0.121132 -0.042804
polarizability: 9.45449689e+01 9.00916599e-01 9.68709070e+01 4.65502399e+00 -2.58713005e+00 5.71247915e+01
1716.lowfreq: -9.6036 -2.7183 -0.0012 -0.0011 -0.0007 10.4782 62.3028 89.5508 102.9852
frequency: 62.2836 89.5459 102.9826 137.6202 159.4973 222.1016 253.3385 298.4752 327.3660 346.3270 383.9713 487.0937 562.3689 591.4755 608.5744 682.3383 747.4488 773.7407 852.8738 876.5539 954.4487 971.8947 1016.6004 1029.1638 1051.1022 1055.8849 1080.8607 1125.2913 1178.2780 1208.7783 1243.1394 1289.8551 1292.4194 1313.7625 1336.3713 1359.2838 1381.2592 1403.2317 1453.9864 1459.1773 1463.8229 1484.2879 1569.7724 1659.8596 2944.8697 2973.3398 2975.2972 2977.1015 3047.5211 3054.0498 3107.2065 3113.0345 3550.4554 3607.2287
redmass: 5.2092 2.4621 2.9308 3.2114 1.1091 3.8263 3.0163 3.2837 1.1706 5.8719 5.5852 3.9455 5.2548 3.9626 1.1750 4.2764 5.8751 1.7380 1.8398 4.3178 2.2338 2.6472 1.7288 1.9782 3.0285 2.3181 2.8191 1.3054 1.4447 3.0303 1.7370 1.3935 1.2060 2.3073 1.2813 1.6777 1.2365 1.3775 1.1154 1.0631 1.0742 1.0847 5.0926 9.2509 1.0712 1.0536 1.0621 1.0667 1.0969 1.0972 1.0977 1.0948 1.0662 1.0814
irintensity: 0.4807 4.2479 3.3731 1.8514 0.7702 4.3405 4.2313 3.8761 150.9301 1.9409 12.2387 10.4363 22.4524 25.3141 125.7656 6.0301 9.8624 18.6110 7.1931 20.6132 16.7665 77.4870 34.8703 1.3912 22.6872 12.6973 10.6220 19.1843 5.3797 33.7231 76.0001 10.4527 2.3915 27.0765 9.2195 6.1251 7.9560 23.2662 15.4504 19.2792 1.4114 5.4691 6.3487 320.7460 66.0069 1.3117 41.2184 12.9567 17.8471 19.8539 10.9171 6.5557 6.2876 57.0899
temp: 298.150 k
press: 1.00000 atm
elementType: 8 8 7 7 6 6 6 6 6 6 1 1 1 1 1 1 1 1 1 1
symmnumber: 1
zpe: 420479.1 jmol-1
zpe.correction: 0.160152 hartree
zpe.thermalcorrener: 0.170646 hartree
zpe.thermalcorrenthalpy: 0.171590 hartree
zpe.thermalcorrgfe: 0.123859 hartree
zpe.sumelectzpe: -493.781938 hartree
zpe.sumelectthermal: -493.771444 hartree
zpe.sumelectthermalent: -493.770500 hartree
zpe.sumelectthermalfe: -493.818231 hartree
dipole: -1.6623 -4.1676 1.2072
dipole: 4.6465
quadrupole: -69.3003 -58.1249 -58.9577
quadrupole: -8.9407 3.1418 -3.2074
quadrupole: -7.1727 4.0028 3.1699 -8.9407 3.1418 -3.2074
hfenergy: -493.9420899 hartree
pointgroup: C01 [X(C6H10N2O2)]
dipole: -0.6903789 1.6135702 -0.5114652 debye
dipolederiv: -0.9580221 -0.1586102 0.0049587 -0.190221 -0.1875911 -0.1917981 -0.0340161 -0.1696768 -0.508249 -0.7449014 0.409187 0.0637472 0.357091 -1.0203151 -0.0583234 0.0636698 -0.051946 -0.356763 -0.7660343 0.745711 -0.0001703 -0.0934459 -0.5322852 0.0432898 0.1439749 -0.2334419 -0.3417028 -0.32424 -0.4053066 0.0739826 -0.083216 0.4147258 -0.0595358 0.1261159 0.0600974 -0.1738915 -0.3075965 -0.0877653 0.0736472 -0.0027766 -0.4021957 0.0626377 0.0699556 0.116435 0.176356 0.0189627 0.0692157 0.0215677 0.1738911 0.1554397 -0.052762 0.1381383 -0.0186191 0.0724551 0.3518587 -0.1320926 -0.08709 -0.1481548 0.2974633 -0.0510913 -0.2031867 -0.0325861 -0.0188536 1.1650611 -0.6589898 -0.2299113 -0.1883252 0.9475323 0.001811 -0.3440214 0.0690506 0.2499247 0.6871411 0.1445088 0.0757385 0.0910196 0.1956431 0.0827494 0.0172502 0.0618476 0.422698 -0.0152797 0.0107787 0.0150256 0.0620711 -0.1634833 0.0188233 0.0319957 0.0090296 0.059218 0.1288062 -0.009333 0.0377171 0.0127239 0.0863983 0.0127523 -0.0043647 0.0109222 -0.0608827 0.0414495 -0.0089596 0.0302744 0.0047573 0.0689801 0.0198806 0.0237507 -0.0020704 -0.1065612 0.0243192 -0.0345483 -0.0095827 -0.0241919 -0.17828 0.0178966 0.0019838 0.0373193 0.061716 0.1076174 -0.0035245 -0.0169538 0.0183934 -0.0282591 0.0013293 -0.0056807 0.0315377 0.0760852 -0.0330177 -0.0237546 -0.032137 -0.009169 0.0606693 0.0408776 -0.0111596 -0.0171343 -0.2464213 0.2038141 0.0548214 0.0492528 0.0553526 0.1843727 0.0167656 0.0639783 0.0204419 0.3513693 -0.0785461 0.0882162 0.0435178 0.009487 0.0836734 0.0056616 0.0575067 -0.0161959 0.1070857 0.1150566 0.007337 0.051386 0.0035377 0.0279751 0.0389156 0.021842 0.100637 -0.0949918 0.0219712 -0.0863992 -0.0984303 -0.0573594 -0.0123392 -0.0367847 -0.0865552 -0.0764702 0.0385755 0.3615799 0.079508 -0.0665402 0.0085351 0.0018755 0.086905 -0.0711772 0.1008225 0.2928334 unknown
polarizability: 94.677277|-1.009522|96.7108418|-4.2060407|-3.4428562|57.1525487 unknown
InChI: InChI=1S/C6H10N2O2/c1-4-5(2-3-9)6(10)8-7-4/h5,8-9H,2-3H2,1H3
charge 0 multiplicity 1
20 atoms
O  3.635359 0.647034 0.440725
O  0.350442 -2.322496 -0.202293
N  -1.714761 -1.288628 0.345832
N  -2.321741 -0.000661 0.359275
C  -0.10004 0.168138 -0.474738
C  1.156321 0.737095 0.244277
C  -1.413547 0.847519 -0.106584
C  -0.396528 -1.312106 -0.117579
C  2.467287 0.098722 -0.262243
C  -1.711007 2.31087 -0.234751
H  0.066734 0.231417 -1.571056
H  1.076599 0.57723 1.33531
H  1.191865 1.83337 0.074602
H  2.481327 -0.979852 -0.047546
H  2.559507 0.236877 -1.36256
H  -2.251347 -2.084528 0.686494
H  -2.752564 2.511826 0.063398
H  -1.565361 2.659954 -1.274886
H  -1.04139 2.915639 0.406559
H  3.708646 1.615781 0.244464
