program: Gaussian 09
title: 000246967
version: EM64L-G09RevD.01
frameworkgroup: C1[X(C8H7ClN4)]
method: RPBEPBE
basis: SDD
operation: Freq
keyword: #p
keyword: freq=noraman
keyword: PBEPBE/SDD
title: #p freq=noraman PBEPBE/SDD
converged: YES YES NO NO
title: Mulliken charges:
elementType: Cl N N N N C C C C C C C C H H H H H H H
charge: 0.021331 -0.175962 -0.033734 0.006804 0.061704 -0.130884 -0.491359 -0.460497 0.125395 -0.202755 0.124467 -0.300523 -0.361636 0.277410 0.252549 0.243015 0.252018 0.256730 0.280205 0.255721
chargesum: 0.00000
title: Mulliken charges with hydrogens summed into heavy atoms:
elementType: Cl N N N N C C C C C C C C
charge: 0.021331 -0.175962 -0.033734 0.006804 0.061704 0.146526 0.004205 0.048251 0.125395 0.077451 0.124467 -0.300523 -0.105915
polarizability: 1.66223935e+02 -2.67207654e+00 1.27410394e+02 -4.39190143e+00 -1.20218437e-01 6.01714015e+01
1716.lowfreq: -7.8900 -0.0027 -0.0018 -0.0015 3.8728 7.7341 34.9492 60.7054 126.1269
frequency: 34.7301 60.6996 126.1248 147.3233 202.7519 231.3126 265.3632 329.5810 376.3759 394.5402 530.5563 548.8797 551.0485 625.3583 639.8895 655.8665 668.8223 775.0911 791.8874 799.0096 826.0516 853.5290 870.9996 900.3673 916.9068 939.7459 1048.1753 1058.1386 1067.4816 1102.0877 1107.3651 1142.4250 1163.8609 1175.9277 1189.5483 1230.5271 1279.1307 1298.6858 1306.7764 1358.7855 1381.3913 1399.1896 1439.5739 1451.9824 1466.2968 1498.5159 1562.7708 3108.3658 3120.4246 3131.5401 3185.1770 3210.1919 3230.4283 3236.1348
redmass: 2.9136 6.5763 3.6183 7.9659 8.3336 5.6799 5.5943 4.3798 9.7277 4.4212 3.8659 6.9560 4.6980 7.3560 5.2830 4.8167 4.7332 1.1689 6.8080 7.8493 1.3667 1.4922 4.3435 6.9748 1.4345 3.6372 2.2546 1.2641 1.1769 1.2772 4.2094 3.3444 1.4212 4.2666 2.3412 1.9798 4.5128 4.3204 3.1139 2.0397 3.3460 1.8725 1.0896 4.9294 1.3161 9.5474 10.9002 1.0538 1.0613 1.0901 1.0928 1.1176 1.1154 1.0988
irintensity: 0.0930 0.2881 0.5432 0.0215 1.4075 1.0303 0.1714 3.3412 7.3222 0.7810 1.7165 19.0431 0.9885 2.4125 19.0715 3.0827 8.6144 0.5281 4.7865 35.1439 14.3264 14.8874 7.3139 96.5722 12.5149 2.6154 7.8551 39.0841 7.7116 0.7336 12.0053 7.1931 2.6505 26.8283 56.3592 61.8286 23.7950 88.5071 35.7430 0.4409 14.7845 65.8135 13.3055 101.0732 9.2213 123.9632 82.4825 7.8898 3.2031 11.0215 9.2143 2.8483 17.2542 0.2057
temp: 298.150 k
press: 1.00000 atm
elementType: 17 7 7 7 7 6 6 6 6 6 6 6 6 1 1 1 1 1 1 1
symmnumber: 1
zpe: 376905.7 jmol-1
zpe.correction: 0.143556 hartree
zpe.thermalcorrener: 0.154000 hartree
zpe.thermalcorrenthalpy: 0.154945 hartree
zpe.thermalcorrgfe: 0.105876 hartree
zpe.sumelectzpe: -987.150577 hartree
zpe.sumelectthermal: -987.140133 hartree
zpe.sumelectthermalent: -987.139189 hartree
zpe.sumelectthermalfe: -987.188257 hartree
dipole: 6.3003 -0.0417 -0.3419
dipole: 6.3097
quadrupole: -78.9296 -84.2573 -80.6457
quadrupole: -4.5683 -0.9949 0.3336
quadrupole: 2.3479 -2.9798 0.6318 -4.5683 -0.9949 0.3336
hfenergy: -987.2941331 hartree
pointgroup: C01 [X(C8H7Cl1N4)]
dipole: -2.4699667 -0.1806639 -0.1704139 debye
dipolederiv: -0.7366753 -0.3846506 -0.0855734 -0.4693772 -0.3534165 -0.0634013 -0.1031952 -0.0616637 -0.0744734 -0.7522502 0.0625316 -0.018389 -0.2142014 -0.4764245 -0.0336137 0.0352383 -0.0004817 -0.1730479 -0.6778711 0.0064536 -0.0045108 0.0887547 -0.3536085 0.015654 -0.0445287 -0.0095821 -0.2358414 -0.5986081 -0.0050088 -0.034563 0.0578527 -0.4461253 -0.0329118 -0.0339538 -0.0308674 -0.1729867 -0.5584744 -0.0474501 -0.0359108 -0.3576814 -0.9827649 -0.0945745 -0.0704226 -0.0612534 -0.1598002 0.6072537 0.0601539 0.1176264 0.1408136 0.1671932 0.0497522 0.227045 0.0393766 0.1635946 -0.0638132 0.0697334 0.0755499 0.1725913 -0.089512 -0.0685181 0.0459612 -0.0408652 0.0458978 0.0521774 -0.0066136 0.0066697 -0.0845529 -0.0782705 0.1324429 -0.01303 0.1240601 0.0022557 0.7948805 -0.3439411 0.0115468 -0.0357202 0.1862494 0.0466882 0.0463207 -0.0398886 0.1247796 0.4478114 0.1885967 0.0555062 0.5003247 0.4514083 0.0218204 0.057069 0.0518575 -0.0266042 -0.6489175 -0.1982689 -0.0658872 -0.5283712 0.0941338 -0.0415587 -0.1152391 -0.0180874 0.0751601 1.4137114 0.4667055 0.1576302 0.6991343 1.0182283 0.1365769 0.1952468 0.1180993 0.0724402 0.5933885 0.106099 0.0682872 0.0862166 0.608903 0.0586608 0.0772796 0.0585759 -0.0460715 -0.0882106 -0.038006 0.0168559 -0.0782443 0.0981765 -0.0173569 -0.0316899 -0.0182102 -0.0743791 -0.0804279 0.0545343 -0.0608646 0.0388775 0.0776165 -0.0152584 -0.0705942 0.0029837 0.0679423 0.0821801 -0.0321947 -0.0508735 0.0082974 0.0080519 -0.0871759 -0.0466316 -0.0807547 0.0265916 0.0744266 0.0306971 -0.0932413 0.0073383 0.0513619 0.0235518 -0.1000796 0.025151 0.0147049 0.0270323 -0.0653579 -0.0450536 -0.0828618 -0.0263804 -0.0164983 -0.0402638 -0.0409209 0.0753457 0.037464 0.0596844 -0.011269 0.038504 0.0962337 -0.001786 -0.0087804 -0.007444 0.161013 0.0749226 0.0163022 -0.0035359 0.0123055 -0.0510537 -0.0124938 -0.0057517 -0.0100847 0.1334789 unknown
polarizability: 166.2874477|0.3026907|127.0637842|5.580438|3.417326|60.4544978 unknown
InChI: InChI=1S/C8H7ClN4/c9-7-6-8(11-3-10-7)13(4-12-6)5-1-2-5/h3-5H,1-2H2
charge 0 multiplicity 1
20 atoms
Cl 3.760413 1.139758 0.332524
N  -1.212535 0.424751 -0.24427
N  0.505911 1.940427 0.031029
N  0.113032 -1.677258 -0.245267
N  2.507392 -1.253056 0.038392
C  -2.553535 -0.075887 -0.485483
C  -3.700467 0.414886 0.40892
C  -3.187043 -1.026557 0.531386
C  -0.036926 -0.329592 -0.171007
C  -0.817893 1.769734 -0.12514
C  1.021146 0.633823 0.004997
C  2.313401 0.073746 0.106708
C  1.413602 -2.069222 -0.133218
H  -2.768524 -0.253656 -1.543705
H  -4.66723 0.595557 -0.067489
H  -3.453778 1.105876 1.220234
H  -2.593622 -1.28359 1.412119
H  -3.794945 -1.844249 0.137554
H  -1.545898 2.577795 -0.158852
H  1.615697 -3.141788 -0.183931
