program: Gaussian 09
title: 000246968
version: EM64L-G09RevD.01
frameworkgroup: C1[X(C10H13ClN4)]
method: RPBEPBE
basis: SDD
operation: Freq
keyword: #p
keyword: freq=noraman
keyword: PBEPBE/SDD
title: #p freq=noraman PBEPBE/SDD
converged: YES YES NO NO
title: Mulliken charges:
elementType: Cl N N N N C C C C C C C C C C H H H H H H H H H H H H H
charge: 0.020076 -0.147608 -0.033605 -0.005624 0.060577 -0.367342 -0.392711 -0.335459 -0.359243 0.129444 -0.211716 0.129380 -0.691688 -0.301840 -0.360311 0.228692 0.206833 0.220873 0.250976 0.198076 0.188351 0.198596 0.203539 0.272528 0.221038 0.212796 0.210194 0.255177
chargesum: 0.00000
title: Mulliken charges with hydrogens summed into heavy atoms:
elementType: Cl N N N N C C C C C C C C C C
charge: 0.020076 -0.147608 -0.033605 -0.005624 0.060577 0.068183 0.079139 0.050968 0.042892 0.129444 0.060812 0.129380 -0.047660 -0.301840 -0.105135
polarizability: 1.98645236e+02 4.60659913e+00 1.45278149e+02 1.79620493e+01 -3.15481737e+00 8.78303222e+01
1716.lowfreq: -8.8019 -7.7611 0.0015 0.0019 0.0021 2.6101 10.8806 33.0557 43.3848
frequency: 10.2878 32.9468 43.3777 86.7683 102.1860 121.4116 153.8940 180.2119 209.5481 238.6276 240.6392 265.1923 311.9204 347.6879 377.4592 450.6847 529.6956 545.4811 564.0768 626.3486 645.2458 652.5711 729.1066 731.5659 756.0920 790.7590 804.3326 838.0021 846.1547 894.2817 902.6833 914.8232 959.6653 1008.8460 1046.5769 1070.6423 1075.9403 1103.4673 1117.9618 1147.4610 1183.5642 1194.9547 1227.1927 1249.8527 1263.9487 1286.8662 1288.1773 1291.8445 1304.1859 1317.1449 1343.3097 1355.1044 1363.1201 1367.9548 1393.5245 1399.9119 1441.5482 1466.1295 1467.3221 1473.7434 1479.5126 1481.7476 1489.3681 1505.0805 1565.8133 2956.2671 2970.5801 2975.0551 2983.1580 2998.1821 3011.4048 3024.6896 3045.7522 3071.2762 3075.9253 3080.9668 3186.0869 3228.6124
redmass: 4.0378 6.7261 1.8723 2.2402 5.7456 1.8988 4.9032 6.5019 5.4913 1.1089 4.1194 4.3730 4.9763 3.3461 16.2451 3.4037 4.6982 5.6500 7.9181 6.9832 5.0529 6.6175 1.2218 3.3776 1.1697 6.6475 10.9023 1.2571 1.5349 2.7361 3.2862 1.4338 1.2297 3.6161 3.2278 2.2629 2.4313 5.6036 2.4489 4.3876 2.5991 1.8153 1.7154 1.2800 1.6030 1.1268 4.3593 1.3271 3.6601 1.3729 1.8452 1.6047 2.1395 2.0466 1.2145 1.9348 2.2158 1.0709 1.2683 1.2091 1.0454 1.0965 1.0935 7.1312 9.6901 1.0591 1.0594 1.0363 1.0612 1.0969 1.0608 1.1015 1.1027 1.1008 1.0993 1.1056 1.0929 1.0986
irintensity: 0.4297 0.1680 0.0908 0.0350 0.6534 0.0647 0.0933 1.4699 1.6857 0.0130 1.3415 0.5838 0.1668 0.9231 8.4282 2.1510 6.8971 8.3956 6.1206 4.9546 16.2585 7.5476 11.4843 18.9086 0.3289 5.0652 27.6283 4.3966 14.1546 30.5894 57.9054 12.7585 1.6149 4.7061 3.8822 10.6794 0.9470 30.0712 9.6446 54.6817 0.0736 41.1154 44.2139 5.5256 5.7725 2.6261 48.3825 6.6608 68.1852 7.3889 42.9619 0.0330 9.3183 1.4095 12.3701 58.7076 64.5786 0.1175 34.1509 17.8081 12.5775 15.7661 28.4162 105.9594 87.8502 13.1086 40.5762 37.3674 30.7485 2.6736 39.9088 11.6497 27.0190 67.6130 47.7190 30.0243 9.2895 0.1561
temp: 298.150 k
press: 1.00000 atm
elementType: 17 7 7 7 7 6 6 6 6 6 6 6 6 6 6 1 1 1 1 1 1 1 1 1 1 1 1 1
symmnumber: 1
zpe: 581884.6 jmol-1
zpe.correction: 0.221628 hartree
zpe.thermalcorrener: 0.236097 hartree
zpe.thermalcorrenthalpy: 0.237041 hartree
zpe.thermalcorrgfe: 0.176850 hartree
zpe.sumelectzpe: -1066.811936 hartree
zpe.sumelectthermal: -1066.797467 hartree
zpe.sumelectthermalent: -1066.796523 hartree
zpe.sumelectthermalfe: -1066.856714 hartree
dipole: -6.4696 -0.7296 -1.2384
dipole: 6.6274
quadrupole: -106.9209 -96.8668 -95.6886
quadrupole: 4.4510 -1.5126 2.0328
quadrupole: -7.0955 2.9587 4.1368 4.4510 -1.5126 2.0328
hfenergy: -1067.033564 hartree
pointgroup: C01 [X(C10H13Cl1N4)]
dipole: -2.5349236 -0.2316332 -0.5648511 debye
polarizability: 197.6117325|3.6082758|145.0500961|21.2748001|-3.8006545|89.0918787 unknown
InChI: InChI=1S/C10H13ClN4/c1-2-3-4-5-15-7-14-8-9(11)12-6-13-10(8)15/h6-7H,2-5H2,1H3
charge 0 multiplicity 1
28 atoms
Cl 4.739055 -0.530493 0.94361
N  -0.076129 -0.763362 -0.588063
N  1.779881 -1.930949 0.129211
N  0.840604 1.534744 -0.510241
N  3.170063 1.571705 0.235257
C  -2.418745 -0.258872 0.184653
C  -1.463716 -0.481033 -1.009288
C  -3.862199 0.030536 -0.283494
C  -4.839618 0.248743 0.894258
C  0.914912 0.188095 -0.352561
C  0.498459 -2.004978 -0.277603
C  2.066675 -0.557672 0.090072
C  -6.282751 0.53806 0.429138
C  3.199108 0.236776 0.375564
C  2.007329 2.16553 -0.198212
H  -2.045037 0.588382 0.791023
H  -2.409443 -1.15419 0.837767
H  -1.810333 -1.325522 -1.633237
H  -1.433467 0.423174 -1.642876
H  -3.867455 0.930101 -0.933283
H  -4.228591 -0.810603 -0.909147
H  -4.832595 -0.648821 1.545679
H  -4.475257 1.089278 1.518805
H  -0.061758 -2.933468 -0.373876
H  -6.959612 0.688429 1.289743
H  -6.324197 1.449931 -0.195729
H  -6.682864 -0.299959 -0.172313
H  2.029882 3.253037 -0.299759
