program: Gaussian 09
title: 000246976
version: EM64L-G09RevD.01
frameworkgroup: C1[X(C22H16N2)]
method: RPBEPBE
basis: SDD
operation: Freq
keyword: #pfreq=noraman
keyword: PBEPBE/SDD
title: #p freq=noraman PBEPBE/SDD
converged: NO YES NO NO
title: Mulliken charges:
elementType: N N C C C C C C C C C C C C C C C C C C C C C C H H H H H H H H H H H H H H H H
charge: 0.010255 0.027072 -0.311559 -0.313272 0.356791 0.366696 0.273133 0.269262 -0.101013 0.059264 0.204065 -0.438966 0.378952 -0.441005 -0.391584 -0.389015 -0.382015 -0.429147 -0.245904 -0.259505 -0.244834 -0.259213 -0.814168 -0.813835 0.289611 0.297334 0.230585 0.230154 0.260635 0.236659 0.234723 0.235078 0.229739 0.229563 0.223006 0.276874 0.222904 0.230180 0.231363 0.231139
chargesum: 0.00000
title: Mulliken charges with hydrogens summed into heavy atoms:
elementType: N N C C C C C C C C C C C C C C C C C C C C C C
charge: 0.010255 0.027072 -0.311559 -0.313272 0.356791 0.366696 0.273133 0.269262 -0.101013 0.059264 0.204065 -0.149355 0.378952 -0.143671 -0.161000 -0.158861 -0.121380 -0.192488 -0.011181 -0.029767 -0.009756 -0.029650 -0.091384 -0.121153
polarizability: 4.56624815e+02 5.63231930e+00 3.18992088e+02 -9.29750147e-03 5.34853085e-03 1.00689361e+02
1716.lowfreq: -9.0500 -4.4025 -0.0006 0.0007 0.0008 5.4999 34.6117 56.8602 87.9429
frequency: 34.6111 56.8600 87.9358 90.6856 104.0419 120.2353 126.4557 145.3020 198.0272 212.5159 215.6661 254.4525 268.6430 300.0896 324.6574 325.0582 360.2135 398.2964 412.7643 430.3550 448.4008 462.4000 465.7054 493.2411 542.0698 546.4586 573.1374 576.3644 587.1072 605.3791 614.1754 615.9555 656.8299 682.7176 700.1504 715.6680 750.9835 758.6229 781.1750 786.8363 788.7492 807.3311 837.1753 855.1862 888.7872 895.8897 928.7343 971.5640 972.1916 978.0470 978.7435 985.3720 993.6751 1007.5307 1010.6399 1023.4071 1029.4592 1043.5290 1049.8238 1053.1300 1074.3954 1092.4692 1109.5339 1127.2806 1167.3010 1174.9123 1176.9495 1214.3193 1234.3234 1243.6423 1268.5251 1288.2658 1295.5494 1305.8313 1329.8109 1350.6762 1385.5137 1388.9179 1394.7833 1396.0962 1401.8066 1418.2399 1438.9145 1447.3459 1459.7038 1463.7506 1467.8033 1472.8623 1485.3103 1491.0932 1498.4217 1504.7269 1546.8181 1562.7459 1588.2045 1610.0580 1611.9480 1618.8856 2969.9459 2973.1087 3039.0508 3045.4835 3086.3184 3112.8786 3128.1201 3129.3307 3130.9754 3145.6149 3149.7910 3159.6183 3165.9080 3166.6569 3171.9970 3174.2566
redmass: 4.0475 4.3800 1.0398 4.0149 3.6061 4.5792 3.6886 1.1083 3.9830 4.6713 4.9104 4.4458 3.9712 2.7283 4.2748 4.9311 4.5690 6.6755 5.0420 3.6859 4.8406 3.5188 5.1712 6.0309 4.4485 4.2920 3.1434 3.9090 8.4585 3.2545 6.4466 6.7109 6.7103 7.6060 6.4303 2.7241 2.0632 5.2500 2.0251 1.7929 6.2896 1.9860 1.6671 1.8619 2.9035 1.4180 5.2036 1.4126 1.3904 2.9760 1.3820 1.5744 7.4325 1.3640 1.5525 1.4368 3.8189 1.9261 2.1760 1.6253 3.4132 2.0854 2.2692 1.5706 1.6058 1.0648 1.1179 2.9395 2.0390 1.6134 5.6726 1.7415 2.8929 3.3298 4.2119 2.7792 2.9468 1.8048 2.8261 6.0324 1.4733 3.1989 2.5127 3.4196 1.9434 1.0474 1.4180 1.4311 1.0476 3.0150 3.1712 7.1685 5.6973 6.3799 7.5520 7.0311 5.8918 6.8241 1.0378 1.0393 1.0966 1.0966 1.0983 1.0962 1.0886 1.0855 1.0859 1.0905 1.0907 1.0958 1.0962 1.0926 1.0984 1.0980
irintensity: 0.2377 1.3407 0.0092 1.5188 0.0990 0.6153 0.6265 1.8044 0.4626 0.1604 0.1470 1.6240 1.0806 0.6783 2.0449 0.1269 0.1454 1.9688 2.7063 1.4134 5.8387 2.0997 3.0042 2.7232 0.4180 5.8938 0.0000 11.0750 0.3281 2.9369 2.1076 3.9662 0.4974 2.6193 0.4724 0.0009 84.4006 4.0407 0.8188 80.2944 0.1833 15.1985 24.2271 3.9121 2.0899 1.0895 1.9743 0.7685 0.4540 0.0116 5.0381 13.4128 2.1348 0.9160 0.3023 7.6001 7.5444 16.0396 14.9799 0.7216 15.1777 21.6703 8.9592 8.0639 8.4509 0.4419 3.0025 0.6234 12.0036 0.5682 1.0094 4.3313 13.2915 13.2992 10.7411 71.2185 1.6874 18.7495 6.5474 43.8218 9.4966 4.2989 35.1502 3.0648 1.8257 6.3050 13.6462 4.1371 25.2961 21.3078 26.3192 1.2371 17.8916 1.9732 2.1153 7.5098 10.4478 2.0686 73.1004 9.2948 37.4684 1.3570 21.5351 3.3836 17.7571 0.3736 3.8093 27.8059 2.7927 2.3920 18.4042 22.4227 36.1424 35.0318
temp: 298.150 k
press: 1.00000 atm
elementType: 7 7 6 6 6 6 6 6 6 6 6 6 6 6 6 6 6 6 6 6 6 6 6 6 1 1 1 1 1 1 1 1 1 1 1 1 1 1 1 1
symmnumber: 1
zpe: 824143.3 jmol-1
zpe.correction: 0.313900 hartree
zpe.thermalcorrener: 0.332201 hartree
zpe.thermalcorrenthalpy: 0.333145 hartree
zpe.thermalcorrgfe: 0.267890 hartree
zpe.sumelectzpe: -955.891013 hartree
zpe.sumelectthermal: -955.872712 hartree
zpe.sumelectthermalent: -955.871767 hartree
zpe.sumelectthermalfe: -955.937023 hartree
dipole: -0.6460 0.6523 0.0021
dipole: 0.9180
quadrupole: -105.6965 -125.9845 -146.0245
quadrupole: 0.2012 -0.0088 0.0010
quadrupole: 20.2053 -0.0826 -20.1227 0.2012 -0.0088 0.0010
hfenergy: -956.204913 hartree
pointgroup: C01 [X(C22H16N2)]
dipole: -0.2479056 0.2626509 0.0008987 debye
polarizability: 456.8157672|2.3201463|318.8007799|0.2360343|0.2103737|100.6897174 unknown
InChI: InChI=1S/C22H16N2/c1-13-11-12-19-20(14(13)2)24-22-18-10-6-4-8-16(18)15-7-3-5-9-17(15)21(22)23-19/h3-12H,1-2H3
charge 0 multiplicity 1
40 atoms
N  -1.167178 1.091989 0.000058
N  -0.771994 -1.741275 -0.002373
C  0.079146 0.555344 0.000437
C  0.281827 -0.885549 -0.000763
C  1.243095 1.452914 0.002072
C  1.644817 -1.433411 -0.00025
C  2.571184 0.91203 0.00253
C  2.775584 -0.552479 0.001372
C  -2.250753 0.238046 -0.001513
C  -2.040402 -1.202217 -0.002778
C  -3.588681 0.779193 -0.001892
C  1.045585 2.862185 0.003191
C  -4.6812 -0.112909 -0.003551
C  1.835446 -2.843529 -0.001374
C  3.663855 1.827713 0.004119
C  4.075994 -1.136954 0.001812
C  -3.170116 -2.075194 -0.004454
C  -4.453693 -1.532841 -0.00486
C  2.137649 3.741915 0.004742
C  3.45703 3.21691 0.005206
C  3.125596 -3.393442 -0.000912
C  4.253269 -2.530357 0.000696
C  -3.79677 2.279241 -0.000193
C  -6.106226 0.408396 -0.00343
H  0.016141 3.23028 0.002789
H  0.943661 -3.476213 -0.002597
H  4.69158 1.454396 0.004522
H  4.964238 -0.499047 0.003045
H  -2.990647 -3.154271 -0.005414
H  -5.324749 -2.198795 -0.006204
H  1.975508 4.825053 0.005586
H  3.263171 -4.479966 -0.001781
H  4.317598 3.895042 0.006414
H  5.265467 -2.949688 0.001078
H  -4.370292 2.604623 0.889385
H  -2.824799 2.794231 -0.000764
H  -4.3726 2.606436 -0.887571
H  -6.836068 -0.4185 -0.009674
H  -6.308499 1.034845 0.886721
H  -6.305076 1.045452 -0.886726
