program: Gaussian 09
title: 000246971
version: EM64L-G09RevD.01
frameworkgroup: C1[X(C13H19ClN4)]
method: RPBEPBE
basis: SDD
operation: Freq
keyword: #p
keyword: freq=noraman
keyword: PBEPBE/SDD
title: #p freq=noraman PBEPBE/SDD
converged: YES YES NO NO
title: Mulliken charges:
elementType: Cl N N N N C C C C C C C C C C C C C H H H H H H H H H H H H H H H H H H H
charge: 0.019913 -0.148312 -0.034256 -0.006223 0.060356 -0.365909 -0.387569 -0.379822 -0.372451 -0.401709 -0.354182 -0.356124 0.128717 -0.210466 -0.695005 0.130365 -0.302867 -0.360079 0.195055 0.203467 0.196955 0.200884 0.211223 0.229354 0.190920 0.192851 0.253672 0.225796 0.189215 0.190089 0.195789 0.194988 0.272886 0.216810 0.210546 0.210009 0.255112
chargesum: 0.00000
title: Mulliken charges with hydrogens summed into heavy atoms:
elementType: Cl N N N N C C C C C C C C C C C C C
charge: 0.019913 -0.148312 -0.034256 -0.006223 0.060356 0.032614 0.010270 0.060755 0.011320 0.077759 0.025122 0.034653 0.128717 0.062421 -0.057639 0.130365 -0.302867 -0.104967
polarizability: 2.40542702e+02 9.46913956e+00 1.69685932e+02 2.48207815e+01 -8.62264891e+00 1.23690861e+02
1716.lowfreq: -4.6968 -0.0010 0.0009 0.0019 2.7851 9.2065 16.6985 23.4112 44.4261
frequency: 15.1440 23.3179 42.7365 49.1034 62.5485 89.3087 102.4318 113.2486 136.5529 149.6220 158.0012 182.4885 190.9602 227.6889 233.0714 261.5981 273.8872 308.0970 369.9195 385.7631 431.7471 476.0060 531.8458 546.1767 566.8847 626.3547 646.7689 652.2168 723.6201 731.2928 734.3002 749.4713 789.5973 791.2489 804.7670 846.7601 855.7680 888.5036 899.7440 914.6305 935.6277 988.9822 1007.4184 1013.5873 1047.0107 1060.2034 1074.6799 1077.1098 1079.9245 1103.9414 1122.0581 1148.6026 1181.7498 1189.6844 1210.4835 1221.5381 1236.7396 1262.9493 1264.5757 1282.8512 1283.6287 1288.6398 1295.7923 1296.9651 1302.3084 1305.7401 1334.3333 1344.4710 1355.1878 1358.2044 1364.0421 1372.6824 1389.3395 1399.4394 1443.2928 1462.6660 1463.1134 1467.6151 1469.7966 1474.6694 1476.7929 1480.5272 1486.6144 1489.7827 1505.1719 1565.4588 2951.8250 2954.2074 2956.3708 2963.7123 2969.6480 2972.6676 2982.0482 2987.6554 2995.6370 3006.3397 3011.5290 3023.2035 3037.5894 3048.4301 3069.1362 3072.2684 3081.9436 3185.6214 3228.6463
redmass: 5.5724 6.6150 2.2125 2.3218 4.7504 1.7346 2.4270 6.4241 1.7862 2.1791 4.5015 6.2671 5.1293 1.1194 4.6715 3.7013 4.5838 3.7015 7.3652 6.7072 3.0220 3.2133 4.6284 5.8896 7.6539 7.0051 5.0563 6.6582 1.0630 1.0793 5.9999 1.1293 1.5451 3.0814 10.4019 1.5318 1.2672 1.9153 6.2723 1.4336 1.2557 4.4970 1.2854 3.1900 3.1515 2.8859 2.2480 2.3830 2.2189 5.4500 2.7969 4.2770 2.3055 2.0075 1.7478 1.2856 1.5674 1.4319 1.3473 1.1559 1.2100 5.5795 1.1027 1.1671 1.5679 2.5456 1.5266 1.6940 1.6405 1.6237 3.3250 1.5184 1.2172 1.9239 2.3076 1.0845 1.0796 1.0795 1.2374 1.1587 1.0432 1.1110 1.0998 1.1018 7.2698 9.7380 1.0590 1.0589 1.0594 1.0594 1.0592 1.0362 1.0615 1.0965 1.0983 1.1007 1.0622 1.1032 1.1037 1.1032 1.1007 1.0993 1.1055 1.0929 1.0986
irintensity: 0.6486 0.3763 0.0231 0.0435 0.0494 0.0033 0.0316 0.5042 0.0309 0.0457 0.5860 0.9460 1.2370 0.0008 1.0408 1.2770 0.7808 0.0360 7.6350 2.3304 0.4902 0.8314 6.6877 9.9632 4.6082 4.9793 16.5039 7.5952 13.4774 0.9271 19.6664 5.8272 1.6905 3.3451 27.3957 13.7757 4.1936 10.9214 79.5872 12.6326 2.4120 1.4432 1.5004 2.2786 2.6085 3.1529 10.7269 0.0414 0.3265 27.4688 14.0139 55.0405 0.9307 19.6500 39.4115 19.7209 22.2106 5.8968 0.3497 1.2397 3.8401 49.9362 0.2270 1.8143 14.7022 59.4126 19.2172 28.6179 0.7141 0.6681 10.0640 1.0964 11.3218 58.8548 68.7898 2.3713 1.1678 0.5540 28.5889 12.3096 12.6542 12.7885 1.4040 43.8336 107.4000 90.9587 0.0401 3.4767 0.7505 15.3296 136.4040 40.3724 35.4704 1.5591 1.3091 1.9115 37.7742 1.0553 44.7586 93.8329 95.2219 53.9686 22.9889 9.3092 0.1690
temp: 298.150 k
press: 1.00000 atm
elementType: 17 7 7 7 7 6 6 6 6 6 6 6 6 6 6 6 6 6 1 1 1 1 1 1 1 1 1 1 1 1 1 1 1 1 1 1 1
symmnumber: 1
zpe: 801902.7 jmol-1
zpe.correction: 0.305429 hartree
zpe.thermalcorrener: 0.324011 hartree
zpe.thermalcorrenthalpy: 0.324955 hartree
zpe.thermalcorrgfe: 0.254987 hartree
zpe.sumelectzpe: -1184.480916 hartree
zpe.sumelectthermal: -1184.462333 hartree
zpe.sumelectthermalent: -1184.461389 hartree
zpe.sumelectthermalfe: -1184.531357 hartree
dipole: -6.3779 -1.2696 -1.8827
dipole: 6.7701
quadrupole: -144.5699 -114.8946 -116.4786
quadrupole: 1.7193 -4.9829 2.6863
quadrupole: -19.2555 10.4197 8.8358 1.7193 -4.9829 2.6863
hfenergy: -1184.7863442 hartree
pointgroup: C01 [X(C13H19Cl1N4)]
dipole: -2.4953848 0.5706859 0.7361486 debye
polarizability: 239.5448346|-12.1881161|167.3255595|-26.03192|-13.0430278|127.0491017 unknown
InChI: InChI=1S/C13H19ClN4/c1-2-3-4-5-6-7-8-18-10-17-11-12(14)15-9-16-13(11)18/h9-10H,2-8H2,1H3
charge 0 multiplicity 1
37 atoms
Cl 6.10793 -0.049591 -1.372956
N  1.513286 0.941512 0.497848
N  3.338913 1.743925 -0.662416
N  2.289007 -1.371403 0.916427
N  4.515414 -1.778716 -0.011336
C  -2.329674 0.470877 0.74574
C  -3.461908 0.1794 -0.26513
C  -0.94103 0.571268 0.076333
C  -4.849029 0.042978 0.402246
C  0.168201 0.881266 1.10615
C  -5.985974 -0.241926 -0.604971
C  -7.370571 -0.393725 0.065643
C  2.418785 -0.11546 0.417197
C  2.116552 2.01864 -0.168336
C  -8.501784 -0.679394 -0.945624
C  3.552824 0.403239 -0.305924
C  4.601084 -0.525796 -0.486855
C  3.377437 -2.151833 0.665656
H  -2.555103 1.415552 1.28392
H  -2.310519 -0.330491 1.513053
H  -3.496808 0.98983 -1.022681
H  -3.228115 -0.75389 -0.817994
H  -0.956404 1.359897 -0.702263
H  -0.70231 -0.381863 -0.433374
H  -5.081072 0.972924 0.962682
H  -4.814449 -0.772765 1.154426
H  0.200734 0.090728 1.876683
H  -0.027568 1.845332 1.610999
H  -6.030113 0.577578 -1.352664
H  -5.751864 -1.167154 -1.172052
H  -7.324994 -1.21286 0.812222
H  -7.603948 0.53059 0.63284
H  1.623188 2.985012 -0.256869
H  -9.479555 -0.786232 -0.44093
H  -8.306386 -1.613817 -1.505006
H  -8.59036 0.140019 -1.683848
H  3.351587 -3.17905 1.036763
