program: Gaussian 09
title: 000246969
version: EM64L-G09RevD.01
frameworkgroup: C1[X(C10H15N5)]
method: RPBEPBE
basis: SDD
operation: Freq
keyword: #pfreq=noraman
keyword: PBEPBE/SDD
title: #p freq=noraman PBEPBE/SDD
converged: YES YES NO NO
title: Mulliken charges:
elementType: N N N N N C C C C C C C C C C H H H H H H H H H H H H H H H
charge: -0.149465 -0.088550 -0.036744 -0.064282 -0.611692 -0.369213 -0.384648 -0.337064 -0.359366 0.134795 -0.102023 -0.231992 -0.693485 0.167263 -0.370998 0.202727 0.238190 0.244270 0.209238 0.185658 0.196055 0.203815 0.197558 0.264403 0.218871 0.209201 0.212376 0.241298 0.342705 0.331099
chargesum: 0.00000
title: Mulliken charges with hydrogens summed into heavy atoms:
elementType: N N N N N C C C C C C C C C C
charge: -0.149465 -0.088550 -0.036744 -0.064282 0.062113 0.071704 0.068860 0.044649 0.042007 0.134795 -0.102023 0.032411 -0.053037 0.167263 -0.129700
polarizability: 1.91367310e+02 -7.81233890e+00 1.45282979e+02 -1.85933127e+01 -5.26668950e+00 8.98241065e+01
1716.lowfreq: -1.9841 -0.0008 -0.0007 -0.0004 7.1040 10.1297 26.5764 38.7756 43.9542
frequency: 26.2655 38.6689 43.8964 91.4928 118.4070 122.2763 165.2544 202.4587 210.7072 228.0910 257.5627 292.7528 316.8045 343.9033 453.4875 504.2468 509.1605 535.8986 543.3585 560.0309 582.9779 645.2638 670.4534 697.9008 730.2763 742.7674 758.3939 792.4192 821.7490 836.7751 856.2836 895.0345 927.1240 959.4927 962.4902 1008.2903 1022.4568 1052.5740 1077.6560 1090.8148 1118.2922 1171.5430 1190.3227 1220.8979 1227.5758 1252.5494 1260.6508 1289.7488 1291.4773 1298.4016 1314.4139 1316.7960 1343.2799 1353.8140 1362.3152 1370.3837 1378.1248 1390.3060 1431.9159 1453.5482 1466.1953 1469.4620 1476.1636 1478.0299 1481.8159 1488.6089 1544.2936 1578.4805 1630.9676 2955.2336 2971.4766 2973.7024 2983.9870 2998.4398 3008.0415 3026.1186 3046.7086 3070.0920 3074.0214 3077.2984 3162.6793 3227.0150 3541.7587 3697.4578
redmass: 4.3016 2.0420 3.2738 2.3378 3.1627 2.1337 4.5389 5.0178 3.1509 1.1176 4.3794 3.7260 3.9907 3.4011 3.3419 1.2228 8.9916 4.0332 1.0598 3.8115 5.2432 4.8211 8.6508 5.8325 1.0715 5.0083 1.2166 3.4803 1.9469 1.5299 3.6916 1.8916 1.4308 2.4591 1.2310 3.6085 4.1562 3.1212 2.4106 1.9971 2.4592 2.6464 1.8326 1.7946 2.3745 1.2895 1.6656 1.2391 1.0593 7.0022 3.9573 1.4230 2.1618 1.5367 1.4637 1.6691 5.2494 1.2155 2.5014 1.7515 1.0699 1.1724 1.4181 1.0831 1.1756 1.1007 6.1358 1.9436 2.7190 1.0589 1.0581 1.0378 1.0626 1.0961 1.0597 1.1018 1.1024 1.1012 1.0993 1.1060 1.0920 1.0982 1.0442 1.1056
irintensity: 0.5752 0.2124 0.4208 0.3755 3.6352 0.8496 1.3540 2.5315 8.9123 0.0078 3.7322 2.3036 1.7049 1.2016 3.3445 276.7959 2.9456 2.4295 0.1299 1.6413 1.6555 45.8807 2.0270 6.4996 11.4608 14.3860 2.0895 20.8909 6.1447 5.6446 0.6015 3.4413 12.0519 9.7119 1.3895 7.0341 13.3741 3.4613 1.3388 16.5117 7.7040 6.4457 13.9005 26.6521 33.7704 7.8923 7.3414 0.1274 2.8802 56.4269 35.0221 12.9090 71.7808 0.6180 8.9159 9.4431 8.8144 12.8595 63.4327 8.8085 0.3300 9.3266 9.6011 14.4151 12.3216 27.0481 55.5203 35.0736 599.2904 15.7675 47.6728 32.3709 24.7290 4.8899 50.0255 14.4801 13.7367 57.5673 49.7320 53.9371 18.2026 0.2582 118.9388 48.2959
temp: 298.150 k
press: 1.00000 atm
elementType: 7 7 7 7 7 6 6 6 6 6 6 6 6 6 6 1 1 1 1 1 1 1 1 1 1 1 1 1 1 1
symmnumber: 1
zpe: 652923.7 jmol-1
zpe.correction: 0.248686 hartree
zpe.thermalcorrener: 0.263178 hartree
zpe.thermalcorrenthalpy: 0.264123 hartree
zpe.thermalcorrgfe: 0.205522 hartree
zpe.sumelectzpe: -662.717548 hartree
zpe.sumelectthermal: -662.703056 hartree
zpe.sumelectthermalent: -662.702111 hartree
zpe.sumelectthermalfe: -662.760712 hartree
dipole: 1.7640 -2.1121 0.2043
dipole: 2.7594
quadrupole: -77.3467 -92.1062 -90.8198
quadrupole: 0.3094 -4.6377 1.5587
quadrupole: 9.4109 -5.3486 -4.0623 0.3094 -4.6377 1.5587
hfenergy: -662.966234 hartree
pointgroup: C01 [X(C10H15N5)]
dipole: -0.7121238 0.8193748 -0.0100904 debye
polarizability: 191.3067925|-4.8695093|145.5388237|20.066545|-0.0788873|89.6287791 unknown
InChI: InChI=1S/C10H15N5/c1-2-3-4-5-15-7-14-8-9(11)12-6-13-10(8)15/h6-7H,2-5,11H2,1H3
charge 0 multiplicity 1
30 atoms
N  -0.060313 0.899252 -0.593389
N  1.844902 1.988799 0.097961
N  0.746683 -1.44956 -0.457268
N  3.08706 -1.574349 0.299199
N  4.373983 0.336187 0.829818
C  -2.371015 0.261756 0.165875
C  -1.455093 0.666016 -1.011532
C  -3.822057 0.003141 -0.296103
C  -4.751794 -0.418425 0.865508
C  0.886995 -0.096498 -0.332251
C  2.055714 0.596971 0.088796
C  0.568481 2.121833 -0.313571
C  -6.201295 -0.684249 0.405731
C  3.188392 -0.207236 0.411707
C  1.896995 -2.107097 -0.121287
H  -2.356353 1.059966 0.934422
H  -1.95901 -0.651726 0.635026
H  -1.4473 -0.138713 -1.768899
H  -1.825623 1.589138 -1.494548
H  -4.232285 0.91565 -0.778112
H  -3.826598 -0.79086 -1.071509
H  -4.34062 -1.329251 1.345348
H  -4.746543 0.372735 1.642528
H  0.051351 3.072057 -0.433143
H  -6.845067 -0.984843 1.25241
H  -6.64551 0.219796 -0.052053
H  -6.235409 -1.493105 -0.348194
H  1.868162 -3.198457 -0.195198
H  4.465875 1.345869 0.9164
H  5.151692 -0.283595 1.045925
