program: Gaussian 09
title: 000246963
version: EM64L-G09RevD.01
frameworkgroup: C1[X(C16H14N2O2)]
method: RPBEPBE
basis: SDD
operation: Freq
keyword: #p
keyword: freq=noraman
keyword: PBEPBE/SDD
title: #p freq=noraman PBEPBE/SDD
converged: YES YES NO NO
title: Mulliken charges:
elementType: O O N N C C C C C C C C C C C C C C C C H H H H H H H H H H H H H H
charge: -0.434488 -0.249805 -0.432049 -0.022395 0.334249 0.005007 -0.382001 -0.379135 0.469667 -0.232627 -0.226658 -0.415185 -0.357841 -0.240226 -0.220295 -0.190181 -0.190737 -0.257453 -0.320908 0.143765 0.244100 0.258179 0.310966 0.227745 0.226460 0.225818 0.273412 0.271347 0.229931 0.228250 0.228064 0.231412 0.263172 0.380440
chargesum: 0.00000
title: Mulliken charges with hydrogens summed into heavy atoms:
elementType: O O N N C C C C C C C C C C C C C C C C
charge: -0.054048 -0.249805 -0.121083 -0.022395 0.334249 0.005007 -0.137901 -0.120956 0.469667 -0.004882 -0.000198 -0.189367 -0.084429 -0.010295 0.051053 0.038069 0.037327 -0.026041 -0.057736 0.143765
polarizability: 3.69796428e+02 1.64225532e+01 2.77808239e+02 -1.75979997e+00 -7.35106598e-01 8.64276508e+01
1716.lowfreq: -5.3160 -0.0011 -0.0010 -0.0008 3.4655 5.2567 33.9416 40.4790 47.3289
frequency: 33.9156 40.4428 47.3236 50.3365 56.3150 63.6144 120.0002 156.4436 159.2180 187.6318 230.3184 254.1800 275.5679 298.8273 307.4144 378.4550 406.1515 407.9954 450.9089 469.0570 501.2900 521.1366 556.6043 570.3305 606.4032 612.5789 617.1591 627.4204 658.8248 687.6807 697.2695 701.6911 705.1671 763.7992 775.1271 807.1291 835.4077 852.7784 873.3824 888.1698 907.4800 926.2871 964.6461 970.8471 980.5502 982.3373 986.7539 988.0307 992.6806 997.4331 1010.4188 1020.1796 1035.0096 1061.3984 1084.6829 1086.8117 1170.7759 1172.7147 1179.1166 1179.6118 1192.8065 1222.2951 1260.9825 1275.5287 1307.2030 1318.4995 1324.3254 1352.1473 1381.0436 1386.9223 1429.1497 1436.9122 1467.5946 1482.9915 1487.1502 1524.6525 1583.7451 1601.3838 1603.7905 1610.8736 1614.3319 1635.0761 3103.6658 3117.8512 3124.4964 3131.7506 3134.8870 3144.6983 3147.1221 3149.5713 3158.4248 3166.9848 3169.5941 3184.2578 3380.8478 3527.4469
redmass: 4.0506 5.3142 5.0429 5.9580 5.7608 6.1546 5.3030 4.3263 5.5726 5.1900 4.7980 4.7046 5.1507 4.3459 4.4624 4.9697 2.8713 2.9033 3.7630 4.1154 2.9220 3.8756 2.4173 4.3667 1.5635 6.4138 5.5201 4.4346 6.2027 1.7512 1.9703 1.7744 4.9261 1.7065 1.9574 5.7031 1.2599 1.2548 2.3988 3.6559 1.4401 1.4362 3.0219 1.3687 1.5949 3.9896 2.9412 4.1906 1.3383 1.3379 1.7837 2.1219 1.9325 2.0661 1.6107 1.5476 1.0780 1.0538 1.3930 2.0025 1.2085 1.4095 2.5017 1.9099 1.4772 1.4397 1.4952 2.4289 7.9830 6.3752 2.5708 2.2600 3.4436 2.4107 2.6237 2.1575 6.0471 5.1408 5.6733 6.1373 5.9878 7.1854 1.0893 1.0882 1.0848 1.0881 1.0869 1.0932 1.0932 1.0917 1.0961 1.0986 1.0998 1.0960 1.0747 1.0641
irintensity: 0.2659 0.7739 0.0865 0.9075 0.8286 0.4352 0.3701 5.9557 2.6049 0.9396 2.7096 2.9483 2.5769 12.7096 5.9178 7.1168 0.3828 0.0423 9.3046 12.1527 43.0172 30.1719 68.2907 25.1446 47.1420 3.3595 0.6959 40.5059 2.9851 8.8151 126.4742 3.2989 38.5319 89.1369 54.8085 11.9426 0.2604 0.6581 2.5936 40.9780 7.1519 8.4590 10.1791 0.6607 10.0932 15.6386 102.3289 9.3436 2.2529 3.5901 23.8830 12.4554 131.1846 255.6667 67.6169 13.4232 0.2072 0.1370 6.0278 36.3455 1.6669 15.6482 26.1569 122.7762 36.7094 18.1441 1.5333 113.6317 2.3126 26.8518 143.7193 9.3995 239.3898 88.9833 2.0643 418.9392 30.6037 52.4432 208.9689 87.6334 57.7438 194.0718 3.6231 10.2069 4.5422 3.7903 1.0305 26.3477 24.4116 7.0216 28.5801 37.1650 17.0277 4.7736 5.1326 62.3128
temp: 298.150 k
press: 1.00000 atm
elementType: 8 8 7 7 6 6 6 6 6 6 6 6 6 6 6 6 6 6 6 6 1 1 1 1 1 1 1 1 1 1 1 1 1 1
symmnumber: 1
zpe: 688404.4 jmol-1
zpe.correction: 0.262199 hartree
zpe.thermalcorrener: 0.279649 hartree
zpe.thermalcorrenthalpy: 0.280593 hartree
zpe.thermalcorrgfe: 0.214628 hartree
zpe.sumelectzpe: -876.622119 hartree
zpe.sumelectthermal: -876.604669 hartree
zpe.sumelectthermalent: -876.603725 hartree
zpe.sumelectthermalfe: -876.669690 hartree
dipole: -2.0026 -0.1730 -0.3681
dipole: 2.0435
quadrupole: -104.9549 -102.8167 -124.3074
quadrupole: -7.2314 -5.1718 -2.7984
quadrupole: 5.7381 7.8763 -13.6144 -7.2314 -5.1718 -2.7984
hfenergy: -876.8843187 hartree
pointgroup: C01 [X(C16H14N2O2)]
dipole: 0.7770681 0.0382839 -0.2026651 debye
polarizability: 369.4881051|13.0640875|276.7276267|-19.1014083|-5.5122388|87.8165863 unknown
InChI: InChI=1S/C16H14N2O2/c19-16(20)12-11-15(13-7-3-1-4-8-13)18-17-14-9-5-2-6-10-14/h1-12,17,19H
charge 0 multiplicity 1
34 atoms
O  -0.716904 -4.864972 -0.386489
O  -2.394698 -4.024134 0.998311
N  1.318961 -0.381591 -0.059836
N  0.267469 0.470166 -0.104019
C  -2.032126 1.110862 0.116131
C  -0.994136 0.040619 0.084455
C  -3.397845 0.805477 -0.139918
C  -1.680044 2.46109 0.396334
C  2.644116 0.101828 -0.188228
C  -4.382075 1.817398 -0.107049
C  -2.662414 3.47054 0.420637
C  3.714635 -0.808568 0.016327
C  2.90941 1.452553 -0.533163
C  -4.020544 3.154477 0.173314
C  -1.415302 -1.344562 0.316212
C  5.04583 -0.365113 -0.12297
C  4.245806 1.879659 -0.665378
C  5.32088 0.980273 -0.463132
C  -0.836177 -2.509967 -0.136413
C  -1.417181 -3.811813 0.236489
H  -3.694009 -0.219476 -0.390697
H  -0.631261 2.69755 0.599575
H  1.19269 -1.371689 0.197438
H  -5.428247 1.562381 -0.309529
H  -2.373259 4.503892 0.643124
H  3.507031 -1.851913 0.286635
H  2.071144 2.134441 -0.694829
H  -2.314527 -1.472593 0.936087
H  -4.784459 3.939399 0.199042
H  5.867995 -1.071084 0.037156
H  4.450389 2.922422 -0.93264
H  6.355543 1.321869 -0.570578
H  -0.011126 -2.547238 -0.85551
H  -1.136766 -5.728187 -0.124489
