program: Gaussian 09
title: 000246956
version: EM64L-G09RevD.01
frameworkgroup: C1[X(C22H27NO)]
method: RPBEPBE
basis: SDD
operation: Freq
keyword: #p
keyword: freq=noraman
keyword: PBEPBE/SDD
title: #p freq=noraman PBEPBE/SDD
converged: YES YES NO NO
title: Mulliken charges:
elementType: O N C C C C C C C C C C C C C C C C C C C C C C H H H H H H H H H H H H H H H H H H H H H H H H H H H
charge: -0.486505 -0.276758 -0.244886 -0.071299 -0.001108 -0.052960 -0.445012 -0.428683 -0.744675 -0.394035 -0.398836 -0.388276 0.411134 0.433319 -0.376103 -0.386537 -0.411531 -0.393741 -0.247825 -0.223800 -0.227997 -0.257800 -0.245080 -0.243675 0.263017 0.221900 0.174707 0.207178 0.202455 0.226341 0.196447 0.222730 0.261625 0.211830 0.203083 0.190217 0.190284 0.204637 0.199922 0.192466 0.377013 0.233358 0.270635 0.277057 0.235307 0.221904 0.222548 0.223321 0.222378 0.225339 0.224972
chargesum: 0.00000
title: Mulliken charges with hydrogens summed into heavy atoms:
elementType: O N C C C C C C C C C C C C C C C C C C C C C C
charge: -0.109492 -0.276758 0.018131 0.150601 0.173599 -0.052960 -0.035379 -0.005895 -0.048490 -0.000734 -0.003914 0.004112 0.411134 0.433319 -0.142744 -0.115902 -0.134475 -0.158434 -0.025921 -0.001253 -0.004677 -0.035423 -0.019741 -0.018703
polarizability: 2.62283778e+02 -1.95012772e+01 2.44259180e+02 -8.47625060e+00 6.86654529e+00 2.01521531e+02
1716.lowfreq: -5.7859 -5.0533 -0.0008 -0.0007 -0.0006 9.2514 18.4287 31.2510 43.7000
frequency: 17.9000 30.9860 43.4778 48.1178 48.4853 62.9362 84.7601 106.5528 121.8533 156.4632 177.0437 190.6864 204.1772 222.9853 232.0557 241.5392 273.4312 303.0886 308.9588 341.7174 348.8287 399.9993 401.0308 402.9024 424.2873 439.5310 453.5725 469.0505 487.4123 515.0705 538.2351 553.8526 615.3905 616.2304 639.5600 656.6281 702.4842 708.1376 715.9930 748.7792 755.0780 774.4495 787.1270 788.3290 809.0618 812.6455 849.3710 853.3917 858.0020 877.1111 893.2636 896.2418 897.4984 925.1857 931.4647 934.8790 976.2779 979.2399 981.8468 988.7592 990.1272 992.0309 994.4081 996.7292 1002.1213 1026.5077 1027.9937 1047.1375 1049.6990 1054.6037 1063.4678 1076.9111 1080.8278 1096.7225 1101.0824 1115.4007 1134.6500 1140.9185 1164.1914 1169.7338 1171.0236 1171.3039 1183.5375 1188.4091 1195.0842 1206.5510 1239.2750 1245.5966 1254.0151 1260.1267 1300.7570 1306.2659 1308.8203 1316.7323 1324.6514 1333.7426 1340.3120 1341.3139 1343.7520 1363.7132 1377.6332 1380.1779 1390.2618 1399.1138 1420.9112 1430.7782 1440.4192 1460.3016 1463.0235 1464.6028 1465.2853 1471.8961 1473.7058 1478.5983 1478.7932 1482.5423 1588.9186 1592.0034 1606.1457 1612.6330 2863.0171 2965.7848 2966.7547 2969.9296 2975.5035 2979.0457 2983.5601 3028.5630 3030.9513 3031.4958 3035.3603 3039.7155 3041.4030 3048.2763 3072.0470 3095.3946 3104.1459 3113.4054 3114.8397 3123.9013 3124.9301 3136.5709 3137.0927 3154.1516 3154.5593 3166.7622 3169.3206
redmass: 3.7640 4.5888 3.3782 3.6582 4.2447 4.2666 3.4830 3.4384 3.4982 1.4310 1.8615 4.1570 4.0957 2.2163 2.6067 4.5566 4.4906 3.0673 3.4252 3.4296 3.5141 3.4935 2.9395 2.8575 3.2506 3.7052 2.3287 2.7212 2.8568 3.2652 2.8461 3.3595 6.4120 6.3975 5.1566 5.2854 1.9336 1.7180 3.6839 1.9322 1.7715 1.9447 1.5347 1.5161 3.1501 2.4559 2.0299 1.2535 1.2534 1.7474 2.2749 2.4605 1.5689 1.8232 1.6037 1.9016 1.5119 1.4131 2.4667 4.4875 5.3031 2.8832 1.8818 1.3924 1.4308 2.1292 2.0904 1.4682 1.6346 1.1776 1.7614 1.5696 1.4360 1.6805 2.7463 2.6265 1.8092 2.1982 1.6270 2.0763 1.1005 1.3267 1.2510 1.1442 1.5624 3.2188 1.3821 1.4343 1.2828 1.2818 1.2691 1.3352 1.2832 1.3331 1.3752 1.3899 1.4699 1.5531 1.4814 1.5231 8.0823 6.9838 1.6583 1.5818 1.5277 2.1677 1.8705 1.0878 1.0885 1.0785 1.0884 1.0861 2.1771 1.1741 1.0991 1.8322 6.2744 6.2715 6.1168 6.0860 1.0820 1.0636 1.0647 1.0615 1.0601 1.0613 1.0370 1.0958 1.0898 1.0935 1.0971 1.1028 1.0692 1.1027 1.0987 1.0889 1.0994 1.0854 1.0852 1.0873 1.0875 1.0933 1.0934 1.0972 1.0970 1.0971 1.0974
irintensity: 0.0813 0.2030 0.0684 0.0569 0.2161 0.0005 0.1906 1.0350 1.3068 0.2754 0.1080 0.7010 0.9525 0.0450 0.1361 1.2983 3.3647 0.3658 3.1266 4.1961 3.9087 5.3768 0.8718 0.1106 5.4777 2.4764 1.4622 0.2125 1.5268 12.3398 3.0357 3.8730 0.0763 0.0354 16.6572 17.3861 37.3648 83.4079 13.6401 10.6037 25.5740 65.6532 26.2593 15.6066 4.2944 26.0817 19.9260 0.2697 0.6937 1.8568 2.8141 17.9680 8.7475 0.5622 5.0893 2.0383 5.4998 0.7300 9.3558 3.4596 6.9123 17.0642 11.3375 1.2091 2.1199 8.5405 9.4755 1.5525 0.2752 0.4601 6.8916 2.2400 5.0191 12.2654 33.9030 0.5840 22.9314 1.8374 12.6850 21.8522 1.1169 5.1890 4.9418 0.6852 1.6000 8.4609 2.4078 5.0125 1.7358 4.1362 21.5934 3.3114 0.5540 0.6772 17.8176 2.6868 6.4932 11.1370 3.9208 35.5717 0.5293 0.9092 1.4742 27.3176 69.5607 9.0195 83.7028 7.1801 8.9130 15.3360 8.1558 20.1149 22.2072 5.1680 2.1219 18.5214 0.3878 0.7774 10.6583 3.4779 51.2358 35.8324 37.5378 36.7481 21.0665 24.2996 37.0473 43.1991 153.8674 44.3338 16.4113 4.4063 263.6872 112.5606 38.9122 9.5662 8.3199 10.7937 4.1871 2.6436 4.3729 17.3391 51.2273 30.1298 27.4575 18.5697 10.0243
temp: 298.150 k
press: 1.00000 atm
elementType: 8 7 6 6 6 6 6 6 6 6 6 6 6 6 6 6 6 6 6 6 6 6 6 6 1 1 1 1 1 1 1 1 1 1 1 1 1 1 1 1 1 1 1 1 1 1 1 1 1 1 1
symmnumber: 1
zpe: 1139131.3 jmol-1
zpe.correction: 0.433872 hartree
zpe.thermalcorrener: 0.455896 hartree
zpe.thermalcorrenthalpy: 0.456840 hartree
zpe.thermalcorrgfe: 0.381457 hartree
zpe.sumelectzpe: -982.708287 hartree
zpe.sumelectthermal: -982.686264 hartree
zpe.sumelectthermalent: -982.685319 hartree
zpe.sumelectthermalfe: -982.760703 hartree
dipole: -2.3784 -0.7479 -2.5156
dipole: 3.5418
quadrupole: -137.6331 -139.0775 -139.1077
quadrupole: -1.3970 -2.3009 3.4911
quadrupole: 0.9730 -0.4714 -0.5016 -1.3970 -2.3009 3.4911
hfenergy: -983.1421597 hartree
pointgroup: C01 [X(C22H27N1O1)]
dipole: 0.9804388 -0.4204568 0.896465 debye
polarizability: 259.8859531|21.4746856|247.4265974|-6.3340009|0.3955161|200.7519383 unknown
InChI: InChI=1S/C22H27NO/c1-17-21(23(17)20-15-9-4-10-16-20)22(24,18-11-5-2-6-12-18)19-13-7-3-8-14-19/h2-3,5-8,11-14,17,20-21,24H,4,9-10,15-16H2,1H3
charge 0 multiplicity 1
51 atoms
O  -0.542815 -0.111548 -1.770407
N  1.486892 -1.025271 -0.451247
C  0.265455 -0.827819 0.408436
C  0.735976 -2.237979 0.059166
C  2.828072 -0.712282 0.125252
C  -0.880692 -0.089439 -0.343584
C  3.905621 -1.535743 -0.612964
C  3.104451 0.802559 0.004549
C  0.05683 -3.163197 -0.934516
C  5.323542 -1.190179 -0.09776
C  4.519857 1.152675 0.52237
C  5.606732 0.327513 -0.208439
C  -0.933969 1.379699 0.161319
C  -2.249679 -0.765199 -0.148746
C  -1.300944 1.677016 1.499397
C  -3.242123 -0.601582 -1.146578
C  -0.601664 2.443739 -0.709479
C  -2.561959 -1.512322 1.013156
C  -1.324191 3.011754 1.959333
C  -4.52239 -1.173108 -0.98471
C  -0.628128 3.781318 -0.251378
C  -3.844651 -2.08412 1.177916
C  -0.985106 4.071451 1.084972
C  -4.83105 -1.914885 0.180428
H  0.435284 -0.495953 1.441432
H  1.236762 -2.754346 0.896135
H  2.854266 -0.990079 1.209639
H  3.833825 -1.310203 -1.695791
H  3.701529 -2.617949 -0.493054
H  2.332684 1.375061 0.554291
H  3.017053 1.088015 -1.063237
H  -0.70214 -3.781099 -0.42144
H  -0.451093 -2.592679 -1.72851
H  0.79855 -3.83932 -1.398848
H  6.079276 -1.765711 -0.665881
H  5.417333 -1.501371 0.963807
H  4.577154 0.947774 1.61201
H  4.706489 2.235865 0.393378
H  6.606901 0.560508 0.205207
H  5.624767 0.617232 -1.279305
H  0.444374 -0.373836 -1.767138
H  -1.596938 0.86991 2.180617
H  -2.988898 -0.04069 -2.051265
H  -0.340565 2.201427 -1.743846
H  -1.801676 -1.671204 1.787424
H  -1.615128 3.226272 2.99422
H  -5.279625 -1.042273 -1.766421
H  -0.373214 4.596214 -0.939062
H  -4.070857 -2.663657 2.080579
H  -1.00745 5.108266 1.439602
H  -5.825527 -2.358027 0.306365
