program: Gaussian 09
title: 000246952
version: EM64L-G09RevD.01
frameworkgroup: C1[X(C20H25NO2)]
method: RPBEPBE
basis: SDD
operation: Freq
keyword: #p
keyword: freq=noraman
keyword: PBEPBE/SDD
title: #p freq=noraman PBEPBE/SDD
converged: YES YES NO NO
title: Mulliken charges:
elementType: O O N C C C C C C C C C C C C C C C C C C C C H H H H H H H H H H H H H H H H H H H H H H H H H
charge: -0.443734 -0.478185 -0.241156 -0.210648 -0.361934 -0.365674 -0.406328 -0.411311 -0.199230 -0.398619 0.507494 -0.232450 0.428084 -0.436685 -0.403724 -0.231049 -0.267156 -0.475614 -0.398682 -0.243821 -0.227447 -0.223307 -0.240507 0.238564 0.258719 0.190642 0.196694 0.225498 0.211858 0.200748 0.200781 0.221042 0.223317 0.191605 0.219579 0.230622 0.237839 0.284999 0.360984 0.370617 0.224502 0.228835 0.264870 0.276066 0.227976 0.225981 0.223044 0.226301
chargesum: 0.00000
title: Mulliken charges with hydrogens summed into heavy atoms:
elementType: O O N C C C C C C C C C C C C C C C C C C C C
charge: -0.082750 -0.107569 -0.241156 0.027915 0.087426 0.056518 0.006278 0.010513 0.024087 0.012564 0.507494 -0.001828 0.428084 -0.198846 -0.118725 -0.006546 -0.038320 -0.210744 -0.122616 -0.015846 -0.001466 -0.000263 -0.014206
polarizability: 2.49170794e+02 -1.52970436e+01 2.51585946e+02 4.25839129e+00 1.49230362e+00 1.67759480e+02
1716.lowfreq: -5.9158 -0.0006 -0.0005 -0.0002 3.8002 6.2083 30.2085 41.4935 44.7089
frequency: 30.1394 41.3300 44.5353 54.1891 64.3578 77.2974 84.2984 102.1057 146.8105 180.2334 207.9332 216.0294 227.6156 246.1606 263.7764 274.8620 317.0634 318.6377 357.0344 370.0942 389.9949 412.6538 415.4881 433.3743 447.7268 454.1336 473.8249 494.4446 525.5490 564.0120 597.7123 614.2090 616.4723 619.5499 665.7484 710.5221 712.1441 752.1710 769.3665 788.3558 793.4872 803.4926 846.0114 859.7920 861.9584 864.0519 866.9351 900.1959 921.1103 934.1644 947.5717 959.3239 972.0594 976.6908 982.5311 986.4577 988.1285 993.3872 998.7735 1002.4275 1010.3582 1018.0229 1025.9971 1029.5627 1043.4513 1048.0225 1077.8973 1078.9503 1082.1858 1096.9871 1115.2473 1145.5405 1157.8202 1168.6277 1172.8984 1175.7883 1178.1702 1195.8684 1207.5920 1209.5760 1213.6232 1240.2064 1255.9141 1272.5456 1277.6153 1290.4982 1291.9088 1304.1068 1323.9262 1331.4130 1336.0531 1343.9295 1347.1559 1354.5578 1355.6599 1372.1325 1378.1068 1388.0330 1392.4474 1438.4469 1443.4945 1455.7310 1463.6584 1464.8618 1469.2194 1477.4510 1483.1690 1486.1655 1524.9311 1591.3247 1592.7122 1611.8504 1614.5052 2718.1112 2889.7402 2900.2898 2923.0616 2950.8427 2972.2535 2977.0050 2986.5442 2987.7210 3038.3404 3045.7333 3055.3406 3073.0933 3090.3072 3111.6069 3115.8362 3123.8552 3124.2605 3135.2506 3137.1237 3146.0086 3154.1391 3162.4951 3165.5903 3521.1956
redmass: 4.9787 3.5333 3.3550 4.0096 4.2514 5.4737 4.6772 4.3641 4.6560 3.4438 5.6941 2.4338 3.7293 4.8249 4.5307 3.5417 2.2490 3.9440 3.1717 1.3414 3.1612 2.8726 2.3584 2.8610 2.4727 3.5084 3.0627 4.1106 3.1695 3.8350 3.3562 5.0650 6.1675 4.2486 4.5287 1.9761 1.6996 1.9105 2.1860 2.9976 3.0729 1.5526 2.6143 1.8323 2.0862 1.2578 1.4795 2.3353 1.5552 1.4260 1.4932 2.0534 2.7719 1.3654 1.3872 1.4057 5.0834 3.6050 1.3890 1.4669 4.3663 3.6099 2.1547 2.3341 2.4867 2.5967 1.8163 2.0299 1.7298 1.7676 2.4364 2.2190 1.2806 1.0837 1.0578 1.3965 1.2064 1.1377 1.8554 1.7050 1.8972 1.2657 1.2330 1.1773 1.2172 1.3191 1.3638 1.5511 1.2792 1.2834 1.2687 1.3409 1.4418 1.4893 1.4757 1.8031 1.5729 5.5973 2.3921 2.1293 2.0693 1.0871 1.0852 1.0895 1.0930 2.0851 1.2401 1.8825 1.2184 6.0063 5.8618 6.0302 5.9925 1.0738 1.0719 1.0713 1.0822 1.0814 1.0629 1.0844 1.0614 1.0618 1.0965 1.1025 1.1030 1.0892 1.0891 1.0868 1.0873 1.0868 1.0864 1.0916 1.0926 1.0960 1.0963 1.1015 1.0986 1.0657
irintensity: 0.4547 0.4438 0.4682 0.3811 0.6670 1.2826 0.1060 0.1125 1.9822 3.9160 7.3658 0.0408 0.9785 0.9598 2.5017 2.4903 6.9361 2.3237 10.9472 97.5907 16.6429 0.8415 21.8362 15.9527 15.7721 6.3746 1.3084 3.4533 7.6522 12.9938 14.6481 0.3950 0.6465 1.3647 7.4673 30.4476 60.4481 41.4750 12.2424 27.9040 21.5741 2.1255 2.8439 10.0602 17.3433 0.1373 0.5711 4.2686 1.3441 5.8854 20.4420 17.0838 32.9113 46.4054 7.0390 0.7361 0.1363 15.1233 5.0543 5.0484 66.4493 25.9893 6.1143 5.9981 14.6796 17.6710 21.6814 16.0592 6.5249 3.1478 5.4816 9.1726 7.0306 1.2285 0.0771 10.9075 6.8457 2.2758 4.4497 10.6395 8.9324 10.0301 2.3110 6.7966 1.6105 5.4135 3.4332 19.3927 11.8916 0.3580 2.2408 1.8171 5.0271 0.1340 13.4939 5.5408 8.4385 1.8292 10.6333 14.0101 17.9521 7.0849 18.7970 10.2382 11.4736 26.5929 2.5122 11.9522 65.4691 0.2680 0.9889 6.6385 2.4721 1277.8849 19.5156 33.9409 43.1465 12.6504 41.4289 78.4825 28.5996 21.6340 58.4387 28.6244 66.2296 40.6651 12.6466 6.9502 1.5937 1.6081 0.3897 11.5731 27.4656 33.3537 27.0444 29.3240 17.5757 16.9975
temp: 298.150 k
press: 1.00000 atm
elementType: 8 8 7 6 6 6 6 6 6 6 6 6 6 6 6 6 6 6 6 6 6 6 6 1 1 1 1 1 1 1 1 1 1 1 1 1 1 1 1 1 1 1 1 1 1 1 1 1
symmnumber: 1
zpe: 1067500.6 jmol-1
zpe.correction: 0.406590 hartree
zpe.thermalcorrener: 0.427228 hartree
zpe.thermalcorrenthalpy: 0.428172 hartree
zpe.thermalcorrgfe: 0.356601 hartree
zpe.sumelectzpe: -980.596048 hartree
zpe.sumelectthermal: -980.575410 hartree
zpe.sumelectthermalent: -980.574465 hartree
zpe.sumelectthermalfe: -980.646037 hartree
dipole: -1.8657 -0.7979 1.6954
dipole: 2.6442
quadrupole: -126.2931 -126.7645 -140.4169
quadrupole: 2.4512 3.5981 -4.7945
quadrupole: 4.8651 4.3937 -9.2587 2.4512 3.5981 -4.7945
hfenergy: -981.0026376 hartree
pointgroup: C01 [X(C20H25N1O2)]
dipole: -0.7329822 0.3191356 -0.6657001 debye
polarizability: 248.7604717|15.3230669|251.9343893|-3.1865449|3.6686864|167.8213589 unknown
InChI: InChI=1S/C20H25NO2/c22-19(17-12-6-2-7-13-17)20(23)18(16-10-4-1-5-11-16)21-14-8-3-9-15-21/h1-2,4-7,10-13,18-20,22-23H,3,8-9,14-15H2
charge 0 multiplicity 1
48 atoms
O  0.932454 -1.083963 -1.803489
O  0.496359 1.079233 1.261709
N  -1.67535 1.133975 -0.26212
C  -1.091452 -0.074574 -0.977873
C  -3.140097 1.003977 0.038037
C  -1.460178 2.402976 -1.040045
C  -3.631405 2.184699 0.898319
C  -1.894895 3.635865 -0.222411
C  0.473588 0.027765 -0.967337
C  -3.378139 3.535495 0.193681
C  -1.555194 -1.407363 -0.388574
C  1.094766 0.007247 0.471494
C  2.605725 0.183614 0.393982
C  -1.938194 -2.450085 -1.265771
C  -1.57367 -1.654622 1.010581
C  -2.333668 -3.711521 -0.766283
C  -1.974975 -2.91127 1.512799
C  3.443065 -0.939619 0.163422
C  3.190072 1.46997 0.499765
C  -2.356359 -3.94629 0.627109
C  4.840436 -0.775292 0.017507
C  4.586244 1.63286 0.360266
C  5.415527 0.513117 0.109877
H  -1.390598 -0.052967 -2.051085
H  -3.315351 0.054555 0.564547
H  -3.717781 0.966498 -0.91764
H  -2.036946 2.35848 -1.995135
H  -0.393251 2.498112 -1.295614
H  -3.099098 2.164939 1.869445
H  -4.709289 2.049228 1.109903
H  -1.717289 4.546015 -0.826779
H  -1.253265 3.708974 0.677388
H  0.777246 0.988237 -1.432936
H  -4.020584 3.60553 -0.708374
H  -3.654847 4.378618 0.853937
H  0.877366 -0.987603 0.915873
H  -1.906784 -2.277351 -2.347554
H  -1.286357 -0.859381 1.709293
H  1.924026 -1.051568 -1.842389
H  -0.471488 1.200146 0.907539
H  -2.621976 -4.507132 -1.462506
H  -1.986315 -3.08298 2.595129
H  3.006199 -1.946256 0.139105
H  2.536045 2.318433 0.724198
H  -2.665854 -4.922084 1.018242
H  5.478061 -1.65006 -0.154593
H  5.030839 2.630672 0.452781
H  6.498732 0.64165 0.003283
