program: Gaussian 09
title: 000246957
version: EM64L-G09RevD.01
frameworkgroup: C1[X(C23H23NO)]
method: RPBEPBE
basis: SDD
operation: Freq
keyword: #p
keyword: freq=noraman
keyword: PBEPBE/SDD
title: #p freq=noraman PBEPBE/SDD
converged: YES YES NO NO
title: Mulliken charges:
elementType: O N C C C C C C C C C C C C C C C C C C C C C C C H H H H H H H H H H H H H H H H H H H H H H H
charge: -0.487637 -0.195814 -0.192854 -0.313538 0.105367 -0.581297 0.472137 -0.734647 0.446595 0.509984 -0.388715 -0.399469 -0.394513 -0.414492 -0.236246 -0.242037 -0.376288 -0.444623 -0.237041 -0.249008 -0.218335 -0.244823 -0.224697 -0.220159 -0.237384 0.228516 0.267370 0.239303 0.216985 0.244064 0.200338 0.240138 0.369489 0.240859 0.231010 0.214281 0.290255 0.228927 0.227300 0.245844 0.231509 0.230853 0.221002 0.222716 0.224939 0.228468 0.225751 0.229615
chargesum: 0.00000
title: Mulliken charges with hydrogens summed into heavy atoms:
elementType: O N C C C C C C C C C C C C C C C C C C C C C C C
charge: -0.118148 -0.195814 0.035662 -0.046168 0.105367 -0.125009 0.472137 -0.050106 0.446595 0.509984 -0.147856 -0.168459 -0.180232 -0.124237 -0.007320 -0.014736 -0.130444 -0.213114 -0.006188 -0.028006 0.004381 -0.019884 0.003771 0.005592 -0.007768
polarizability: 2.60518567e+02 2.63336257e+01 2.47765434e+02 -2.87099566e+00 8.31324746e+00 2.31788381e+02
1716.lowfreq: -18.1843 -6.1039 -0.0007 -0.0005 -0.0004 3.8754 8.1164 21.2785 27.0213
frequency: -17.7855 21.2194 26.9221 29.3671 37.1268 42.0545 48.6856 88.5658 113.5675 143.3563 176.7409 188.4037 207.5130 236.8455 249.9545 263.1005 300.3078 318.1411 342.4867 358.3756 383.8964 402.9303 403.5185 404.2231 416.6739 452.8072 475.5692 486.2503 500.3547 553.4578 583.3550 616.2611 616.3204 617.1721 624.0593 632.4171 678.7653 701.2608 703.8010 707.2286 724.1300 742.1173 756.6198 769.7778 784.2160 804.3134 816.9946 853.5035 854.1584 856.0405 863.9057 880.0399 915.1467 922.0943 926.5703 929.5219 969.8620 975.7523 978.0043 979.1659 989.7698 990.2545 990.6303 995.3379 997.6942 1000.0507 1019.8752 1023.3370 1027.0577 1027.2689 1047.9643 1068.0881 1078.7880 1082.1401 1085.5549 1100.9321 1119.3974 1144.6706 1169.3864 1172.4301 1173.6470 1183.4613 1184.7670 1187.0155 1193.2015 1211.8855 1217.0055 1225.4988 1259.2280 1288.6946 1311.1329 1317.0581 1324.2899 1343.0422 1366.8691 1379.3706 1381.2692 1385.2782 1389.9292 1405.5985 1434.1884 1439.6208 1440.7527 1463.8393 1468.1702 1474.5745 1484.8166 1485.5404 1489.9180 1589.2981 1591.4830 1594.6221 1613.7222 1614.6082 1614.6688 2957.1133 2982.5868 3023.3819 3078.3130 3095.0473 3100.9441 3102.6377 3111.1419 3115.4132 3121.4176 3123.3480 3125.0998 3127.2247 3136.2626 3136.7726 3140.1849 3147.7770 3150.2669 3155.8183 3163.9366 3165.5406 3175.1996 3252.4153
redmass: 3.7123 4.7469 4.2840 4.1047 4.8052 4.6761 4.7656 4.4343 3.8737 4.6840 4.1204 4.8755 4.6996 2.4761 2.9196 1.3585 3.9151 3.6819 2.5884 4.3081 3.6393 2.8183 2.8073 2.8616 4.3682 3.5736 3.8897 3.5073 3.8895 3.6919 3.7828 6.0628 6.2525 6.3931 4.0764 4.1623 1.3176 2.4277 1.7566 1.7490 1.7990 2.9561 2.5833 2.1269 2.7208 3.6719 3.8192 1.2554 1.2487 1.2641 3.4389 2.8364 1.4968 1.5856 1.4894 1.6846 1.7138 1.3925 1.3866 1.4021 6.0960 6.1057 5.6809 1.3257 1.3297 1.3238 2.2215 2.4952 2.1466 2.2329 2.3108 1.8856 1.4206 1.6393 1.5769 1.6133 2.1782 2.1403 1.0582 1.0550 1.0701 1.1645 1.3905 1.3630 1.2432 1.9542 2.6863 1.5037 1.5088 1.4909 1.3662 1.3429 1.3365 1.3744 1.8598 2.4042 3.2763 5.8258 2.2521 2.1276 2.1901 2.1757 2.2018 1.1001 1.1452 1.1692 2.0887 1.9523 2.4358 5.9719 6.2810 6.1014 6.1398 6.0850 6.1700 1.0618 1.0353 1.0988 1.0993 1.0903 1.0987 1.0874 1.0862 1.0873 1.0862 1.0870 1.0862 1.0866 1.0914 1.0934 1.0916 1.0963 1.0959 1.0988 1.1016 1.1015 1.0954 1.0643
irintensity: 0.0143 0.2031 0.0134 0.0674 0.1776 0.1837 1.3389 0.3693 0.4377 3.8908 0.4178 2.0974 0.7599 2.6044 0.1911 0.6451 0.1332 1.8301 3.5171 11.3111 1.4176 0.0875 0.2396 0.0674 7.2898 1.4603 5.2324 12.2537 10.8115 16.4431 0.9243 0.3162 0.1398 0.4832 4.3618 10.7265 67.3082 5.4315 85.8327 56.1635 98.6539 38.7856 41.3366 37.2454 7.7149 13.4054 17.9756 0.2810 0.7241 0.4029 4.1513 12.5325 10.9946 0.7375 7.9725 9.3515 4.3991 0.2663 1.0046 0.6657 0.1515 0.4578 0.3722 1.9494 0.1049 2.2315 38.7056 18.8423 6.1776 5.8631 24.3980 10.4934 11.2519 7.5674 3.8994 13.8331 34.3565 0.0574 0.6905 0.0481 0.3339 6.7027 6.3903 2.0057 2.8416 47.7754 4.7466 10.4206 8.6084 18.1560 0.8205 5.3002 6.4718 18.1969 52.3181 8.0027 3.1007 4.5314 34.1288 38.4123 24.4630 10.2774 5.4713 0.8119 11.5520 12.8076 16.3585 13.9404 13.7415 1.4126 0.5085 1.2895 6.4066 5.6585 5.2699 42.2587 15.6508 12.4600 24.6738 6.1296 12.6368 8.1351 17.9359 8.4109 5.0235 2.6245 0.4413 0.4032 15.8976 39.7276 16.1672 34.6417 40.4203 30.6002 24.7519 19.1708 8.8521 171.9209
temp: 298.150 k
press: 1.00000 atm
elementType: 8 7 6 6 6 6 6 6 6 6 6 6 6 6 6 6 6 6 6 6 6 6 6 6 6 1 1 1 1 1 1 1 1 1 1 1 1 1 1 1 1 1 1 1 1 1 1 1
symmnumber: 1
zpe: 1033582.7 jmol-1
zpe.correction: 0.393671 hartree
zpe.thermalcorrener: 0.414826 hartree
zpe.thermalcorrenthalpy: 0.415770 hartree
zpe.thermalcorrgfe: 0.341233 hartree
zpe.sumelectzpe: -1018.404534 hartree
zpe.sumelectthermal: -1018.383379 hartree
zpe.sumelectthermalent: -1018.382435 hartree
zpe.sumelectthermalfe: -1018.456972 hartree
dipole: -1.3490 2.6353 1.9571
dipole: 3.5489
quadrupole: -143.7225 -143.8245 -136.3466
quadrupole: 6.5092 0.2468 -2.5823
quadrupole: -2.4246 -2.5266 4.9513 6.5092 0.2468 -2.5823
hfenergy: -1018.7982052 hartree
pointgroup: C01 [X(C23H23N1O1)]
dipole: -0.6657716 0.7817379 0.9461386 debye
polarizability: 249.4793423|27.7870855|255.8057032|-1.4118324|9.3618507|234.7873368 unknown
InChI: InChI=1S/C23H23NO/c1-23(25,20-15-9-4-10-16-20)22-21(19-13-7-3-8-14-19)24(22)17-18-11-5-2-6-12-18/h2-16,21-22,25H,17H2,1H3
charge 0 multiplicity 1
48 atoms
O  0.6932 -1.44593 -2.122501
N  -0.951836 0.249923 -0.940823
C  0.193241 -0.229496 -0.083356
C  0.318543 1.120076 -0.754779
C  0.906783 -1.475028 -0.666986
C  -2.220966 0.661506 -0.259245
C  0.284511 2.423675 -0.014639
C  0.269386 -2.765697 -0.094701
C  2.413768 -1.41764 -0.386302
C  -3.085445 -0.556379 0.029723
C  0.11439 3.619346 -0.763473
C  0.424271 2.522068 1.3940
C  2.893025 -1.408114 0.949339
C  3.347385 -1.375788 -1.449199
C  0.071447 4.876331 -0.124238
C  0.384378 3.779835 2.037386
C  -3.543951 -1.382285 -1.029343
C  -3.441641 -0.889804 1.359543
C  0.203788 4.960829 1.282021
C  4.27829 -1.353368 1.217381
C  4.734919 -1.324392 -1.181606
C  5.206649 -1.31158 0.150757
C  -4.341061 -2.516444 -0.762695
C  -4.242636 -2.02426 1.630696
C  -4.693122 -2.841461 0.569541
H  0.023946 -0.252134 1.001706
H  0.89823 1.140892 -1.686297
H  -2.736383 1.350396 -0.955483
H  -2.033702 1.222289 0.680403
H  0.706438 -3.639465 -0.606214
H  0.449534 -2.869249 0.991249
H  -0.821381 -2.760737 -0.271138
H  -0.19991 -0.987646 -2.225638
H  0.018132 3.557572 -1.854474
H  0.59582 1.618512 1.989108
H  2.187524 -1.448403 1.789141
H  2.965695 -1.388719 -2.47364
H  -0.060082 5.787373 -0.718604
H  0.503525 3.838965 3.125155
H  -3.267223 -1.134511 -2.060652
H  -3.096042 -0.256573 2.186466
H  0.175232 5.935714 1.781242
H  4.633369 -1.344871 2.2544
H  5.447411 -1.296146 -2.014319
H  6.282331 -1.271593 0.356873
H  -4.688519 -3.146138 -1.58952
H  -4.512321 -2.268716 2.664376
H  -5.312539 -3.721435 0.776259
