program: Gaussian 09
title: 000246946
version: EM64L-G09RevD.01
frameworkgroup: C1[X(C13H17Br2NO)]
method: RPBEPBE
basis: SDD
operation: Freq
keyword: #p
keyword: freq=noraman
keyword: PBEPBE/SDD
title: #p freq=noraman PBEPBE/SDD
converged: YES YES NO NO
title: Mulliken charges:
elementType: Br Br O N C C C C C C C C C C C C C H H H H H H H H H H H H H H H H H
charge: 0.025751 -0.033206 -0.262476 -0.109970 -0.622089 -0.642323 0.345043 -0.350015 -0.391825 0.586451 -0.656945 -0.641421 -0.393519 -0.312246 -0.225471 -0.236099 -0.233096 0.325445 0.365339 0.262333 0.206771 0.247143 0.228792 0.205814 0.258633 0.218515 0.222715 0.234694 0.219745 0.237767 0.226121 0.232010 0.229025 0.232593
chargesum: 0.00000
title: Mulliken charges with hydrogens summed into heavy atoms:
elementType: Br Br O N C C C C C C C C C C C C C
charge: 0.025751 -0.033206 -0.262476 -0.109970 -0.296644 -0.276984 0.345043 0.119089 0.084111 0.586451 0.026018 0.035733 -0.155752 -0.086126 0.006539 -0.007074 -0.000504
polarizability: 2.27617754e+02 2.18476342e+01 1.78364926e+02 3.85677772e+00 -1.75019708e+00 1.58209918e+02
1716.lowfreq: -7.6542 -5.7115 -0.0007 -0.0006 -0.0004 1.3990 26.7208 28.8532 41.1755
frequency: 26.5374 28.7669 41.1516 44.5901 58.1160 65.2128 78.9832 103.9784 129.4655 133.7774 150.7543 173.7725 205.4912 218.2738 226.4649 229.3039 249.5657 318.4187 350.7693 401.1895 420.7438 439.9802 486.2686 526.6493 538.7196 566.0815 602.5893 611.2853 618.0502 697.0989 722.2424 749.8050 778.6581 783.0747 788.5708 845.8308 847.0121 903.1605 926.8442 943.9644 976.6997 990.6179 998.7235 1015.0313 1026.4196 1065.6331 1073.4914 1080.4147 1095.0720 1097.4297 1121.3457 1145.1699 1170.8131 1175.6173 1190.2773 1208.5929 1213.1950 1239.9556 1265.4530 1297.1274 1320.6555 1337.8213 1355.1023 1367.4146 1385.3499 1389.5262 1393.1499 1414.8926 1444.5789 1454.9776 1467.0807 1468.9261 1482.2249 1483.8219 1485.0857 1505.6759 1589.0854 1596.2182 1611.7108 2984.4782 2985.5574 3003.5606 3009.4469 3054.5950 3070.0588 3084.8538 3086.8097 3089.5077 3096.7556 3104.1126 3120.4639 3125.8025 3128.3242 3139.9721 3152.0355 3167.8174
redmass: 5.6607 3.9405 3.5568 5.4400 3.3101 6.9136 3.4150 8.4764 3.8570 5.5764 6.3897 10.2871 1.8083 1.1590 4.5317 3.5867 1.8686 2.8143 3.1396 2.7609 2.5809 4.9240 3.9719 4.1309 5.7091 4.9639 4.1403 4.2215 5.7233 1.6455 6.7277 3.3182 1.7499 1.2486 1.3364 2.1706 1.6584 2.5136 1.4771 2.2176 1.3990 6.1435 1.3332 2.9853 2.2822 2.2543 2.1090 1.8377 1.8338 1.7577 1.5183 1.1156 1.3982 1.1223 1.1215 2.8462 1.4162 1.8056 1.6066 1.3434 1.3584 1.2756 1.2860 1.6899 1.2209 4.4856 1.2267 2.7802 2.1678 1.1051 1.0441 1.0442 1.0499 1.0570 2.3167 1.0953 6.1322 6.2818 6.0454 1.0356 1.0359 1.0626 1.0628 1.1009 1.0998 1.0997 1.0993 1.1015 1.0867 1.1020 1.0868 1.0852 1.0880 1.0918 1.0964 1.1016
irintensity: 0.6199 0.7993 0.1017 1.4600 0.9338 0.1024 0.1322 1.6541 2.2728 1.1040 2.1905 1.1396 0.3207 0.0974 5.0090 0.7066 0.6726 1.3503 14.1439 0.2195 3.7678 26.1511 24.3293 4.1137 106.8659 34.9170 19.5048 1.6966 2.9915 55.2543 1.3155 2.3023 22.3534 5.8553 24.5489 3.8841 1.5392 3.2007 0.5087 8.3816 0.1671 0.8991 0.0481 5.2718 1.0210 8.6446 9.9597 7.8118 9.2240 22.2278 37.0911 16.3622 0.0240 0.4144 6.5700 32.7883 18.1938 72.3657 12.5442 16.6601 11.0013 7.3397 8.2794 4.7544 17.8947 3.7554 25.3436 77.2009 5.1190 24.7881 3.2002 13.2060 3.9344 11.8909 2.5220 8.7242 128.3718 130.9172 2.6549 19.7897 25.8884 26.2721 32.7372 3.4344 10.1785 32.0719 42.7537 30.5868 8.9397 27.7283 2.2835 4.4478 1.5560 13.2191 34.3788 22.2912
temp: 298.150 k
press: 1.00000 atm
elementType: 35 35 8 7 6 6 6 6 6 6 6 6 6 6 6 6 6 1 1 1 1 1 1 1 1 1 1 1 1 1 1 1 1 1
symmnumber: 1
zpe: 714384.4 jmol-1
zpe.correction: 0.272095 hartree
zpe.thermalcorrener: 0.291078 hartree
zpe.thermalcorrenthalpy: 0.292023 hartree
zpe.thermalcorrgfe: 0.221051 hartree
zpe.sumelectzpe: -661.204162 hartree
zpe.sumelectthermal: -661.185178 hartree
zpe.sumelectthermalent: -661.184234 hartree
zpe.sumelectthermalfe: -661.255205 hartree
dipole: 0.9927 -0.8458 3.6658
dipole: 3.8909
quadrupole: -95.4138 -130.6201 -117.4530
quadrupole: 4.2051 7.6650 0.5138
quadrupole: 19.0818 -16.1245 -2.9573 4.2051 7.6650 0.5138
hfenergy: -661.4762563 hartree
pointgroup: C01 [X(C13H17Br2N1O1)]
dipole: 0.3605512 -1.4866121 -0.0579603 debye
polarizability: 229.0736672|-0.6508085|159.6490761|20.4977362|5.0683904|175.4698557 unknown
InChI: InChI=1S/C13H17Br2NO/c1-3-16(4-2)13(17)12(15)11(14)10-8-6-5-7-9-10/h5-9,11-12H,3-4H2,1-2H3
charge 0 multiplicity 1
34 atoms
Br 0.120504 -0.482403 -2.243503
Br -0.366611 0.641514 2.407848
O  1.805896 1.821418 -0.166811
N  2.909896 -0.218759 0.038827
C  0.418471 -0.18466 -0.217043
C  -0.724594 0.665884 0.330835
C  1.772558 0.550715 -0.110188
C  4.209438 0.494084 0.152146
C  2.944103 -1.700788 0.043949
C  -2.142158 0.236502 0.090465
C  4.847839 0.769241 -1.225482
C  2.84366 -2.30499 1.462216
C  -3.113949 1.23203 -0.186627
C  -2.545998 -1.123585 0.146147
C  -4.461333 0.87769 -0.414308
C  -3.890762 -1.478623 -0.079931
C  -4.85355 -0.479216 -0.361292
H  0.415376 -1.204517 0.18948
H  -0.536617 1.723978 0.091972
H  4.023359 1.448331 0.672672
H  4.878322 -0.122563 0.780815
H  2.147526 -2.094761 -0.611058
H  3.897722 -2.006463 -0.425961
H  5.025607 -0.16718 -1.785765
H  4.18738 1.417574 -1.825297
H  5.818317 1.283055 -1.099541
H  3.668823 -1.947624 2.10386
H  1.894536 -2.021375 1.951106
H  2.898999 -3.408069 1.414376
H  -2.809107 2.284616 -0.226546
H  -1.81257 -1.906018 0.372868
H  -5.200775 1.656023 -0.63143
H  -4.19205 -2.530966 -0.036206
H  -5.898857 -0.757195 -0.535793
