program: Gaussian 09
title: 000020036
version: EM64L-G09RevD.01
frameworkgroup: C1[X(C5H9Cl3S2)]
method: RPBEPBE
basis: SDD
operation: Freq
keyword: #p
keyword: freq=noraman
keyword: PBEPBE/SDD
title: #p freq=noraman PBEPBE/SDD
converged: YES YES NO NO
title: Mulliken charges:
elementType: Cl Cl Cl S S C C C C C H H H H H H H H H
charge: 0.048954 0.032774 0.064660 0.012312 0.136220 -0.364188 -0.640442 -0.609197 -0.570131 -0.467822 0.268844 0.230341 0.237918 0.231673 0.216290 0.244765 0.227005 0.351817 0.348207
chargesum: 0.00000
title: Mulliken charges with hydrogens summed into heavy atoms:
elementType: Cl Cl Cl S S C C C C C
charge: 0.048954 0.032774 0.064660 0.012312 0.136220 -0.095344 0.059489 0.078863 -0.218314 -0.119615
polarizability: 1.66679914e+02 1.27837106e+01 1.09592497e+02 4.46478928e+00 -4.04652902e+00 1.00639423e+02
1716.lowfreq: -6.8227 -4.7824 -0.0004 0.0018 0.0020 4.8743 13.0868 38.2407 40.1362
frequency: 12.1601 38.1983 40.0992 67.6183 98.3525 132.2316 156.1899 165.6641 210.6442 219.1847 247.4401 256.4107 293.2223 315.4360 332.8128 395.6735 434.9526 503.5059 560.0029 592.6118 654.9004 715.2465 730.9378 874.4710 926.8131 949.3068 1035.6125 1052.9988 1128.3528 1151.4207 1160.8590 1180.2352 1213.9411 1239.6169 1260.5892 1308.9660 1381.8977 1399.1738 1457.8139 1464.0200 1473.4764 1483.6823 2978.1144 2982.7852 3036.4082 3071.7166 3078.7975 3090.2140 3097.5861 3100.0940 3115.6889
redmass: 8.2693 4.9601 3.1801 11.8941 7.4959 10.4169 23.8305 12.0336 1.2583 2.9930 16.0788 1.1742 4.1331 11.1530 3.2109 2.6337 13.8355 9.0629 3.5077 8.5147 10.7475 6.4338 5.3554 2.7063 1.1572 1.3533 3.2804 1.3286 2.3777 1.1384 1.8634 1.1002 1.2281 1.2596 1.1873 1.4288 1.2072 1.2022 1.0464 1.0448 1.0441 1.0465 1.0364 1.0354 1.0869 1.0980 1.0984 1.1009 1.1004 1.0862 1.0879
irintensity: 0.2477 0.2761 0.1096 0.5789 0.5144 2.1226 0.3766 1.1347 0.6273 0.8244 3.0952 0.0439 0.0889 2.2534 2.4991 0.8314 1.0621 25.3208 3.6978 33.2105 106.1680 34.0564 55.6531 2.5803 3.2713 0.4023 21.9405 28.8703 1.6641 6.9297 42.1872 2.9071 10.7024 30.6817 7.0046 3.0676 30.9214 18.6527 9.7484 2.2271 11.0539 17.9925 23.8978 25.5046 4.6740 9.4167 27.9075 15.3521 32.1336 0.3927 0.8105
temp: 298.150 k
press: 1.00000 atm
elementType: 17 17 17 16 16 6 6 6 6 6 1 1 1 1 1 1 1 1 1
symmnumber: 1
zpe: 346128.4 jmol-1
zpe.correction: 0.131833 hartree
zpe.thermalcorrener: 0.145899 hartree
zpe.thermalcorrenthalpy: 0.146843 hartree
zpe.thermalcorrgfe: 0.087122 hartree
zpe.sumelectzpe: -2371.411298 hartree
zpe.sumelectthermal: -2371.397233 hartree
zpe.sumelectthermalent: -2371.396289 hartree
zpe.sumelectthermalfe: -2371.456009 hartree
dipole: 4.5083 1.2398 -1.2386
dipole: 4.8370
quadrupole: -92.0776 -97.6692 -98.4507
quadrupole: 1.6335 -4.5097 -0.2653
quadrupole: 3.9882 -1.6034 -2.3848 1.6335 -4.5097 -0.2653
hfenergy: -2371.5431314 hartree
pointgroup: C01 [X(C5H9Cl3S2)]
dipole: -1.7945366 0.3655428 0.5171786 debye
dipolederiv: -0.3584754 0.1621199 -0.1523234 0.139911 -0.3257887 0.1839528 -0.2498096 0.2026211 -0.2245608 -0.4095798 -0.2095063 -0.1843987 -0.2742712 -0.3162607 -0.2398577 -0.2079903 -0.2615965 -0.4509364 -0.3483853 0.0336573 0.2578717 0.0421998 -0.1557048 -0.1623299 0.2207455 -0.1157453 -0.4054686 -0.2241935 -0.1107384 -0.0252708 -0.0978565 -0.140432 -0.0043813 0.005527 0.0068717 -0.1462593 -0.1505483 -0.0927086 0.0094513 -0.1548761 -0.0902058 0.0285533 0.0126186 0.0335265 -0.0123103 0.4793662 0.0840368 -0.1450627 0.2923249 0.1160377 -0.0298668 -0.3453896 0.0048494 0.2344239 -0.1641699 0.0952638 0.0597787 -0.1564086 -0.0029795 0.0331993 0.2368468 -0.0874933 -0.0034842 -0.1039629 -0.0407018 0.0198969 -0.0404715 -0.1234911 -0.060222 0.1424791 -0.0244526 0.0149331 0.5395388 -0.1916488 0.309337 0.0148887 0.4123819 -0.3200258 0.4489698 -0.2869568 0.1914951 0.7214777 0.2699583 -0.1379145 0.2390086 0.4234719 0.5185355 -0.1622218 0.4642153 0.884158 -0.0767963 0.0067696 -0.0649176 -0.023006 0.0154481 0.027195 -0.0229889 0.0089977 -0.0959837 -0.0771187 0.0018726 0.1212291 0.0160475 0.0672141 0.0410374 0.1386287 0.0262963 0.008767 0.077361 -0.111269 -0.0507855 -0.0624759 -0.0735661 -0.0703309 -0.0588395 -0.0468508 0.0821352 0.0883208 0.0155927 -0.0640371 0.0225189 0.083111 0.0003109 -0.13931 0.0582716 -0.0652587 -0.0636718 -0.0839028 0.1098871 -0.1101547 0.0673143 0.038934 0.123428 0.0484602 -0.0212979 0.0512267 0.1332371 0.0226829 0.0992832 -0.0189386 -0.0198348 -0.0079046 -0.0431404 0.0859424 0.0443451 -0.0119823 -0.0839034 0.0520706 0.0717462 0.0649635 -0.1306886 0.0110189 -0.0507827 -0.026558 0.0347879 0.0137061 -0.0245172 -0.0126559 0.0021016 -0.0045721 0.0195745 -0.0096146 0.0018237 0.0151619 -0.015227 0.0257843 0.003298 -0.0319343 0.0004715 -0.0184674 -0.0158975 unknown
polarizability: 167.037414|-12.3038284|107.5267118|3.7822566|5.0270516|102.3477078 unknown
InChI: InChI=1S/C5H9Cl3S2/c1-3(2)9-10-5(8)4(6)7/h3-5H,1-2H3
charge 0 multiplicity 1
19 atoms
Cl 2.122874 -1.761519 1.172509
Cl 3.101056 1.582071 1.203869
Cl 3.306263 0.044053 -1.438168
S  -1.48956 0.683063 -0.878721
S  0.014841 -1.019165 -0.883626
C  -2.759102 0.066981 0.439252
C  -3.725288 1.250863 0.640004
C  -3.450416 -1.219796 -0.024894
C  1.20723 -0.319597 0.421632
C  2.144591 0.728538 -0.168764
H  -2.169697 -0.112113 1.355744
H  -4.483199 0.974514 1.396578
H  -3.203229 2.157696 0.992321
H  -4.258882 1.492571 -0.29732
H  -4.1555 -1.567502 0.754842
H  -2.717462 -2.025925 -0.203497
H  -4.018789 -1.047631 -0.956071
H  0.606874 0.131579 1.225277
H  1.566695 1.52392 -0.660467
