program: Gaussian 09
title: 000246928
version: EM64L-G09RevD.01
frameworkgroup: C1[X(C13H15NO)]
method: RPBEPBE
basis: SDD
operation: Freq
keyword: #p
keyword: freq=noraman
keyword: PBEPBE/SDD
title: #p freq=noraman PBEPBE/SDD
converged: YES YES NO NO
title: Mulliken charges:
elementType: O N C C C C C C C C C C C C C H H H H H H H H H H H H H H H
charge: -0.450865 -0.432572 0.318646 0.177255 -0.332336 -0.438345 0.440062 -0.409350 -0.352987 -0.483310 -0.314601 -0.240127 -0.429771 -0.276673 -0.245172 0.208588 0.208525 0.228114 0.228386 0.305921 0.237164 0.191351 0.233850 0.189921 0.189827 0.217107 0.235400 0.224454 0.225553 0.345983
chargesum: 0.00000
title: Mulliken charges with hydrogens summed into heavy atoms:
elementType: O N C C C C C C C C C C C C C
charge: -0.104882 -0.126651 0.318646 0.177255 0.084778 0.018155 0.440062 -0.172186 -0.161635 -0.249460 0.065147 -0.023020 -0.194371 -0.052219 -0.019619
polarizability: 2.18338692e+02 1.22815379e+01 1.79524348e+02 -9.04489650e-02 2.04866441e-02 7.29430581e+01
1716.lowfreq: -15.1731 -8.1751 -0.0003 0.0005 0.0008 4.7467 31.0402 42.9786 62.4827
frequency: 30.9270 42.5221 62.4678 80.7630 101.6763 134.3519 184.1749 194.8921 225.8387 249.5471 264.2982 288.1889 359.0624 419.7878 435.2559 470.7490 474.4061 500.9223 533.0705 570.1513 623.0229 645.4954 727.7452 737.0561 770.5289 781.3202 787.3020 794.3624 845.2747 865.4118 871.8970 893.1933 942.0879 963.5536 971.7992 983.5877 1008.8327 1027.8265 1041.8655 1071.4519 1093.5479 1131.8498 1137.1640 1156.6861 1178.5355 1186.5802 1192.4978 1219.2810 1233.9777 1266.4342 1270.6360 1284.7784 1286.1191 1324.4609 1351.6920 1379.9707 1412.0314 1415.3089 1419.3330 1447.3921 1451.8958 1473.8200 1483.7093 1487.8797 1505.1346 1542.5837 1592.5985 1597.9516 1630.3374 2918.1234 2933.2302 2953.5838 2980.1736 2994.7249 3060.5937 3110.3376 3120.1047 3123.2183 3138.8897 3145.1714 3159.7875 3163.9153 3570.4337 3596.6575
redmass: 4.5867 1.9614 5.1716 2.4964 2.5203 2.5785 3.6783 4.1821 6.2269 1.4724 3.5167 1.0843 4.0316 2.6909 4.0853 5.2831 3.3510 6.0901 5.6053 3.0829 5.8732 3.0691 1.3226 5.3505 1.4850 5.3684 1.2491 1.6081 1.5614 4.5547 1.6979 1.1841 1.3863 1.3296 8.0058 1.3510 3.9359 2.7273 2.3750 2.4850 2.0289 1.5409 2.0798 1.5903 1.0971 1.1673 1.3275 1.3536 1.8185 1.6441 1.1449 1.1051 1.3750 1.9193 1.7419 1.7697 3.6233 2.6786 1.6566 2.4545 2.1133 1.0963 1.2881 1.7665 1.0942 3.0580 5.1081 7.1606 6.0655 1.0564 1.0549 1.1038 1.1067 1.0586 1.1049 1.0857 1.0875 1.0855 1.0939 1.0936 1.1002 1.0963 1.0665 1.0764
irintensity: 1.2624 18.0562 1.0196 3.0701 0.0086 0.0831 0.0303 5.2534 0.5637 39.3957 6.3044 182.3872 3.0727 21.0751 6.1944 11.9477 0.0023 2.3690 7.2153 14.4569 2.6891 1.4014 0.5957 12.0739 134.2013 0.7709 2.6489 26.3033 4.3832 3.5597 9.6605 0.1934 2.1376 1.4692 72.4496 1.1184 30.5321 18.2234 3.9164 0.4680 11.4161 1.3915 17.9080 1.1381 0.5582 0.0295 4.9022 33.5330 4.8776 4.3945 0.7475 1.6376 3.1017 61.4363 4.9747 10.9395 3.5210 105.3265 2.8867 33.3763 2.4336 9.6851 73.2506 36.6154 21.1189 148.6897 53.8481 142.3304 8.4816 49.9256 81.5869 32.8418 54.7147 24.7159 54.4780 13.7756 1.8621 3.7239 29.3167 42.6390 45.6604 17.0776 2.8786 24.7940
temp: 298.150 k
press: 1.00000 atm
elementType: 8 7 6 6 6 6 6 6 6 6 6 6 6 6 6 1 1 1 1 1 1 1 1 1 1 1 1 1 1 1
symmnumber: 1
zpe: 652561.7 jmol-1
zpe.correction: 0.248548 hartree
zpe.thermalcorrener: 0.262840 hartree
zpe.thermalcorrenthalpy: 0.263784 hartree
zpe.thermalcorrgfe: 0.205950 hartree
zpe.sumelectzpe: -633.262064 hartree
zpe.sumelectthermal: -633.247772 hartree
zpe.sumelectthermalent: -633.246828 hartree
zpe.sumelectthermalfe: -633.304661 hartree
dipole: 2.8161 0.8449 0.0168
dipole: 2.9402
quadrupole: -70.7283 -84.1951 -95.8382
quadrupole: 10.7777 0.0310 -0.0046
quadrupole: 12.8589 -0.6079 -12.2510 10.7777 0.0310 -0.0046
hfenergy: -633.5106115 hartree
pointgroup: C01 [X(C13H15N1O1)]
dipole: 1.1121992 -0.3178994 -0.0078104 debye
polarizability: 218.6527032|-11.7707931|179.2097964|-0.0061884|0.2526035|72.9435981 unknown
InChI: InChI=1S/C13H15NO/c15-10-4-9-14-13-8-3-6-11-5-1-2-7-12(11)13/h1-3,5-8,14-15H,4,9-10H2
charge 0 multiplicity 1
30 atoms
O  6.03563 1.029351 -0.002975
N  1.239193 0.191628 0.003024
C  0.026297 -0.492849 0.000542
C  -1.230723 0.246804 0.00163
C  2.543837 -0.471635 -0.003065
C  3.676846 0.57216 -0.002382
C  -2.478248 -0.492278 -0.001489
C  -0.009217 -1.905227 -0.002903
C  -1.288789 1.678822 0.005719
C  -2.466313 -1.92649 -0.004967
C  5.064003 -0.075943 -0.003958
C  -1.248074 -2.607046 -0.005453
C  -3.71464 0.236075 -0.000841
C  -2.509826 2.361723 0.006293
C  -3.737735 1.632069 0.002857
H  2.635842 -1.12672 -0.897933
H  2.640443 -1.132189 0.887131
H  3.594092 1.222899 -0.894205
H  3.594961 1.220192 0.891502
H  1.235751 1.208844 -0.001449
H  0.922863 -2.477207 -0.003613
H  -0.370145 2.278421 0.009225
H  -3.417094 -2.470576 -0.007289
H  5.189214 -0.715209 0.897257
H  5.188488 -0.713123 -0.906751
H  -1.231848 -3.703057 -0.008093
H  -4.652767 -0.332166 -0.00328
H  -2.525329 3.457081 0.009587
H  -4.691927 2.170477 0.003322
H  6.955516 0.663268 -0.007044
