program: Gaussian 09
title: 000246914
version: EM64L-G09RevD.01
frameworkgroup: C1[X(C5H5N5O)]
method: RPBEPBE
basis: SDD
operation: Freq
keyword: #pfreq=noraman
keyword: PBEPBE/SDD
title: #p freq=noraman PBEPBE/SDD
converged: NO NO NO YES
title: Mulliken charges:
elementType: O N N N N N C C C C C H H H H H
charge: -0.262026 -0.191537 -0.260962 0.027914 -0.068926 0.031717 0.041717 0.252610 0.241673 -0.438850 -0.750938 0.260034 0.387768 0.224441 0.252683 0.252682
chargesum: 0.00000
title: Mulliken charges with hydrogens summed into heavy atoms:
elementType: O N N N N N C C C C C
charge: -0.262026 -0.191537 0.126806 0.027914 -0.068926 0.031717 0.041717 0.252610 0.241673 -0.178816 -0.021133
polarizability: 1.27624557e+02 3.77308474e+00 1.06516021e+02 4.09035190e-04 9.26022772e-04 4.14678928e+01
1716.lowfreq: -3.2770 -0.0008 -0.0006 -0.0005 9.9134 11.1016 93.3776 132.3370 158.9867
frequency: 93.3569 132.3367 158.9853 203.6621 257.1702 297.8876 328.2710 409.1934 452.9017 508.0677 575.8464 603.0130 609.1848 618.7670 678.4920 738.3775 793.6559 832.3328 913.4672 948.4322 958.9294 1003.8403 1046.8097 1052.9947 1121.3616 1150.5433 1170.6563 1220.1279 1236.6679 1360.2496 1377.1805 1402.6936 1451.3743 1452.1732 1503.2457 1518.7307 1652.0357 2997.8349 3081.4643 3118.3972 3188.5887 3574.7995
redmass: 1.0532 4.5098 11.1430 4.3990 8.1319 3.1551 8.2697 1.5416 7.1889 7.1068 8.5345 3.6010 3.4750 5.4783 3.7966 8.1908 8.0220 1.4676 3.7734 5.8857 7.7980 1.9263 1.5777 4.1090 7.1903 3.8861 8.3764 1.7737 6.5991 2.0372 2.6225 1.4817 1.0449 1.3742 2.8906 9.1078 10.3264 1.0370 1.0970 1.1006 1.0924 1.0846
irintensity: 0.8374 9.5019 6.9875 1.6855 10.7665 1.5958 12.5598 107.6047 0.4856 2.2759 8.1151 17.8052 30.0696 4.0878 7.1815 0.3922 8.9356 34.4571 31.2068 0.0392 12.5832 11.5496 10.9332 21.6526 49.7205 15.8394 2.9322 8.8878 6.1843 63.2124 45.4113 59.4500 15.6377 30.5373 18.5474 213.5529 501.9285 6.2360 8.1506 17.0960 0.2250 189.5634
temp: 298.150 k
press: 1.00000 atm
elementType: 8 7 7 7 7 7 6 6 6 6 6 1 1 1 1 1
symmnumber: 1
zpe: 285872.2 jmol-1
zpe.correction: 0.108883 hartree
zpe.thermalcorrener: 0.117769 hartree
zpe.thermalcorrenthalpy: 0.118713 hartree
zpe.thermalcorrgfe: 0.074809 hartree
zpe.sumelectzpe: -541.654879 hartree
zpe.sumelectthermal: -541.645993 hartree
zpe.sumelectthermalent: -541.645049 hartree
zpe.sumelectthermalfe: -541.688954 hartree
dipole: -1.0241 1.4938 0.0005
dipole: 1.8111
quadrupole: -52.1627 -81.7879 -62.6562
quadrupole: 5.4302 0.0006 0.0007
quadrupole: 13.3729 -16.2523 2.8794 5.4302 0.0006 0.0007
hfenergy: -541.7637622 hartree
pointgroup: C01 [X(C5H5N5O1)]
dipole: 0.467921 -0.5373682 0.0015492 debye
dipolederiv: -0.4679859 -0.3780936 0.0027572 -0.1369388 -1.3177796 0.0064542 0.0012699 0.007471 -0.3673359 -0.0600632 0.4970422 -0.0024176 -0.103866 -0.7513579 0.0057329 0.001168 0.003206 0.1056076 -0.1725462 0.014196 -0.0002517 -0.4029961 -0.6223226 0.0043535 0.0025081 0.0026694 -0.1938809 -1.2317967 0.2191696 0.002837 0.035037 -0.4523835 0.0012304 0.0039527 0.0004714 -0.2311786 -0.4520128 -0.3720443 0.0034309 0.0214671 -0.1615336 -0.0002005 0.0009782 0.0014449 -0.183143 -0.0824227 0.0981799 -0.0006377 0.1984776 0.7010952 -0.0058246 -0.0013144 -0.0054177 -0.0973681 1.0393621 0.0727585 -0.0039368 0.392414 0.1620843 -0.0013414 -0.0058536 -0.0000378 0.2048018 0.5381332 0.3149725 -0.0032552 0.0611797 1.8880999 -0.0106021 -0.0016956 -0.0116564 0.2171854 1.0107967 0.0181095 -0.004173 0.0531552 0.8189897 -0.005072 -0.0043741 -0.0049275 0.0359616 -0.3419323 -0.5477884 0.003994 -0.1601215 -0.6503617 0.0034329 0.001587 0.0050453 -0.2011618 -0.2267392 -0.1279961 0.0017829 -0.2871721 -0.0453732 0.0015451 0.002762 0.000882 0.0110334 0.0191077 0.0521859 0.0003263 0.0561328 0.0596531 0.0004935 0.0003002 0.0005022 0.1761592 0.3293342 0.1191852 -0.0003373 0.1295069 0.276558 0.0003619 -0.0004029 0.0003964 0.4230525 -0.022773 0.0482216 0.0002868 0.1553368 -0.0336765 0.0002929 -0.000377 0.0007396 0.117949 0.0606262 -0.0144429 0.0043686 -0.0064546 0.0629212 -0.0981426 -0.0392477 -0.1017875 -0.0074651 0.0609117 -0.0136555 -0.0047744 -0.005158 0.0653872 0.097286 0.0387393 0.1009986 -0.010217 unknown
polarizability: 126.4795564|6.085828|107.6566629|-0.3942308|-0.4361142|41.4722513 unknown
InChI: InChI=1S/C5H5N5O/c1-3-2-4(11)10-5(6-3)7-8-9-10/h2,9H,1H3
charge 0 multiplicity 1
16 atoms
O  -0.108081 -2.717739 0.028867
N  -0.725814 -0.448849 0.017349
N  -2.094233 -0.576838 0.024086
N  0.777239 1.434019 -0.000553
N  -1.707154 1.600712 0.008864
N  -2.683572 0.678497 0.01871
C  -0.454046 0.928488 0.007706
C  0.270038 -1.511364 0.019819
C  1.800686 0.488186 0.001065
C  1.582585 -0.905397 0.010619
C  3.195088 1.065679 -0.008297
H  2.430436 -1.59383 0.011409
H  -2.582385 -1.475043 0.03183
H  3.966612 0.280097 -0.006637
H  3.338085 1.715878 0.873197
H  3.330717 1.704906 -0.898935
