program: Gaussian 09
title: 000246895
version: EM64L-G09RevD.01
frameworkgroup: C1[X(C11H21NO)]
method: RPBEPBE
basis: SDD
operation: Freq
keyword: #p
keyword: freq=noraman
keyword: PBEPBE/SDD
title: #p freq=noraman PBEPBE/SDD
converged: YES YES NO NO
title: Mulliken charges:
elementType: O N C C C C C C C C C C C H H H H H H H H H H H H H H H H H H H H H
charge: -0.283979 -0.428955 -0.218362 -0.418112 -0.417795 -0.419933 -0.387787 -0.378312 0.233984 0.315593 -0.754269 -0.691827 -0.694076 0.205912 0.189892 0.211157 0.190411 0.198113 0.186066 0.258797 0.213849 0.191171 0.199305 0.179470 0.303144 0.228731 0.216984 0.217264 0.271006 0.204113 0.202367 0.268346 0.204323 0.203408
chargesum: 0.00000
title: Mulliken charges with hydrogens summed into heavy atoms:
elementType: O N C C C C C C C C C C C
charge: -0.283979 -0.125810 -0.012450 -0.017063 -0.029271 0.024930 0.017233 0.000462 0.233984 0.315593 -0.091289 -0.014342 -0.017999
polarizability: 1.46645505e+02 -3.14507460e+00 1.15902951e+02 1.27600592e+00 -2.71281830e+00 1.11605060e+02
1716.lowfreq: -19.8627 -14.0406 -8.2493 -0.0003 0.0005 0.0009 19.0447 52.7143 99.6745
frequency: -9.3933 52.6094 99.6153 102.6504 133.1687 186.5152 197.7255 229.2202 250.6115 269.0981 272.1465 301.7384 318.0383 336.8889 364.3275 408.3676 418.3232 424.2457 466.8789 483.0059 513.9954 537.3084 657.8885 737.1836 757.1362 779.5914 802.2744 841.7854 865.1638 868.1235 902.0157 915.2220 923.9586 929.5929 940.8500 949.5080 1010.6676 1032.1200 1037.4513 1052.2600 1059.2923 1094.2463 1110.7297 1117.5341 1154.9024 1191.7092 1227.8533 1230.7734 1234.2101 1256.6075 1257.4253 1271.0581 1286.1913 1321.8495 1329.8753 1338.6698 1351.1116 1353.5731 1362.1663 1368.7390 1371.6842 1396.1515 1448.6804 1451.6199 1452.5053 1462.9874 1463.5000 1466.2211 1472.1013 1472.8265 1477.1325 1484.4397 1487.0034 1502.2748 1604.2013 2947.2712 2955.6507 2964.4492 2971.6628 2973.6551 2977.7505 2981.8111 2985.9712 2990.9194 3019.1074 3025.1156 3038.0558 3042.4558 3063.5452 3066.8242 3075.7007 3079.3556 3091.7307 3104.0854 3108.4261 3525.6624
redmass: 3.4651 3.4772 3.0955 3.9392 3.3286 2.3401 1.0646 2.6954 1.0650 1.1931 1.9293 2.3376 3.1397 2.1761 1.9205 2.6454 2.9211 3.0033 2.9214 2.1580 1.1675 2.2438 4.2997 3.6373 3.1609 1.5393 3.4020 2.3412 2.3015 2.0444 2.4983 1.6994 1.6867 1.3931 2.5694 1.2081 2.5491 1.3888 1.4597 1.6566 1.6965 1.6297 1.0756 1.7371 1.7155 1.8866 1.3867 2.4900 3.0111 1.3383 3.0592 1.2723 1.3871 1.7469 1.3097 1.4350 1.4537 1.4129 1.4691 1.2067 1.2136 1.2237 1.0556 1.3965 1.0887 1.0863 1.0913 1.0541 1.0827 1.0495 1.0941 1.0667 1.2906 1.0613 5.7224 1.0760 1.0636 1.0616 1.0365 1.0649 1.0666 1.0354 1.0363 1.0654 1.1005 1.0950 1.1037 1.0965 1.1003 1.0997 1.1001 1.0994 1.0979 1.1001 1.0994 1.0771
irintensity: 1.3944 1.5670 0.8010 5.4990 1.1565 2.4238 0.2258 0.1944 0.1658 1.5011 5.0876 2.8450 8.0045 0.6696 0.6667 0.2166 0.8936 3.8322 4.3537 0.5525 71.7557 0.5668 3.4525 2.2257 1.4754 1.2862 0.5182 9.0223 5.9643 8.9451 0.5065 0.3197 3.9743 9.5448 12.9967 0.6057 5.9331 0.0402 0.5440 0.9731 0.3151 0.4557 3.5373 5.7638 5.5951 17.6628 4.8432 76.7543 22.4766 0.5646 79.8626 0.4287 2.4248 9.8336 0.0843 0.9570 2.3006 0.6898 7.2394 33.4831 37.7189 37.5149 6.5704 203.6685 7.0822 6.4420 1.8634 2.1977 17.9269 2.4195 9.0502 14.1661 78.2811 18.6026 103.4285 19.3721 42.5219 18.0749 21.4602 80.8684 45.5044 39.0881 29.4739 57.8753 58.5748 59.9838 69.5929 22.6162 25.5831 43.7700 30.7357 30.2475 57.5886 2.7183 18.1692 12.3564
temp: 298.150 k
press: 1.00000 atm
elementType: 8 7 6 6 6 6 6 6 6 6 6 6 6 1 1 1 1 1 1 1 1 1 1 1 1 1 1 1 1 1 1 1 1 1
symmnumber: 1
zpe: 797253.2 jmol-1
zpe.correction: 0.303658 hartree
zpe.thermalcorrener: 0.317320 hartree
zpe.thermalcorrenthalpy: 0.318265 hartree
zpe.thermalcorrgfe: 0.264621 hartree
zpe.sumelectzpe: -560.710723 hartree
zpe.sumelectthermal: -560.697061 hartree
zpe.sumelectthermalent: -560.696116 hartree
zpe.sumelectthermalfe: -560.749760 hartree
dipole: -1.2671 2.5445 -2.3088
dipole: 3.6621
quadrupole: -75.9057 -84.4184 -80.7353
quadrupole: -0.9299 -0.1279 0.8709
quadrupole: 4.4475 -4.0653 -0.3822 -0.9299 -0.1279 0.8709
hfenergy: -561.014381 hartree
pointgroup: C01 [X(C11H21N1O1)]
dipole: 0.4922485 -0.9977444 -0.9154354 debye
polarizability: 146.6083769|-3.2990099|115.90151|-1.3162931|2.751128|111.6436289 unknown
InChI: InChI=1S/C11H21NO/c1-11(2,3)12-10(13)9-7-5-4-6-8-9/h9,12H,4-8H2,1-3H3
charge 0 multiplicity 1
34 atoms
O  0.126036 1.246152 0.763119
N  1.30802 -0.265674 -0.562086
C  -1.084485 0.043798 -1.049336
C  -2.220506 1.090964 -0.905919
C  -1.611408 -1.387814 -0.710894
C  -2.965542 1.007216 0.449336
C  -2.303058 -1.444469 0.671237
C  -3.465914 -0.426663 0.743389
C  0.153523 0.406354 -0.193058
C  2.648147 -0.140585 0.095705
C  3.603642 -1.08691 -0.670477
C  3.152045 1.32339 -0.010689
C  2.549082 -0.5735 1.582348
H  -0.749623 0.037473 -2.109326
H  -2.944119 0.920344 -1.730426
H  -1.805308 2.107486 -1.037324
H  -0.787853 -2.127498 -0.76115
H  -2.348486 -1.672749 -1.489962
H  -3.819653 1.712618 0.442268
H  -2.274135 1.328727 1.248313
H  -1.566035 -1.215403 1.4668
H  -2.674973 -2.470769 0.858498
H  -3.944378 -0.464339 1.741248
H  -4.243666 -0.711926 0.00306
H  1.242714 -0.912405 -1.351622
H  4.615202 -1.03362 -0.232855
H  3.262868 -2.138084 -0.607913
H  3.680701 -0.799691 -1.736479
H  2.44748 2.004073 0.49359
H  3.243698 1.628135 -1.069291
H  4.14443 1.417278 0.467042
H  1.834972 0.072522 2.118072
H  2.209574 -1.622516 1.661689
H  3.538707 -0.489414 2.067791
