program: Gaussian 09
title: 000246901
version: EM64L-G09RevD.01
frameworkgroup: C1[X(C19H16N2)]
method: RPBEPBE
basis: SDD
operation: Freq
keyword: #pfreq=noraman
keyword: PBEPBE/SDD
title: #p freq=noraman PBEPBE/SDD
converged: NO YES NO NO
title: Mulliken charges:
elementType: N N C C C C C C C C C C C C C C C C C C C H H H H H H H H H H H H H H H H
charge: -0.667774 -0.051428 0.054170 -0.464678 -0.587682 0.180647 0.320274 -0.556280 0.130737 0.133119 0.236337 0.217743 -0.377920 -0.446604 -0.407043 -0.402618 -0.272523 -0.253477 -0.235971 -0.236665 -0.340990 0.231157 0.238733 0.258497 0.239596 0.231992 0.270015 0.260599 0.246594 0.241729 0.241942 0.226633 0.226445 0.227495 0.227258 0.313630 0.346313
chargesum: 0.00000
title: Mulliken charges with hydrogens summed into heavy atoms:
elementType: N N C C C C C C C C C C C C C C C C C C C
charge: -0.007831 -0.051428 0.054170 0.005212 -0.089589 0.180647 0.320274 -0.054273 0.130737 0.133119 0.236337 0.217743 -0.117321 -0.200010 -0.165314 -0.160676 -0.045890 -0.027032 -0.008476 -0.009407 -0.340990
polarizability: 2.61753862e+02 1.82295126e+01 2.36402683e+02 1.25386660e+00 2.17058516e+00 1.47574940e+02
1716.lowfreq: -11.9506 -0.0008 -0.0007 -0.0005 0.1236 4.8699 39.3983 55.0311 70.8114
frequency: 39.3975 55.0264 70.8040 99.5856 124.2318 125.6918 175.6952 184.4632 187.5505 242.2763 265.2631 291.7925 299.3130 310.0677 361.7791 372.1494 410.6399 428.1265 437.5275 459.5233 479.9842 509.8208 528.3526 534.0866 556.7201 569.3960 572.7265 602.2823 618.0150 627.6172 654.3443 698.9077 714.7763 744.5704 756.6884 759.3548 769.3914 797.4765 827.4422 863.4065 877.8490 883.0053 932.8231 944.4781 947.3164 954.2049 963.8318 984.9927 987.5105 996.8169 1025.3089 1028.8212 1049.3464 1051.9548 1099.2570 1111.2413 1118.7312 1148.4864 1157.5180 1171.6186 1176.3883 1189.4565 1203.2108 1213.0180 1234.1264 1239.4572 1271.1805 1293.1469 1304.5251 1307.2122 1328.9309 1343.5367 1377.9702 1402.5697 1407.1567 1436.2870 1442.6458 1455.6337 1460.7131 1463.8322 1472.9776 1483.5298 1588.1831 1593.2844 1615.5971 1619.8463 1622.2878 1651.9890 2133.7717 2964.1761 2968.5336 2990.9534 3016.6651 3029.1014 3058.8164 3118.3058 3124.1287 3128.3419 3134.3217 3142.4774 3147.6763 3161.6422 3162.9707 3531.5105 3682.3833
redmass: 6.1084 5.1984 5.1494 5.0027 3.5513 6.2935 3.3987 4.7995 3.4467 3.3429 4.1857 4.0583 2.3929 3.7759 1.3341 2.4283 6.0201 3.2755 3.3900 2.9402 3.5824 5.1620 4.3526 1.3395 3.7966 3.7155 3.5078 4.0687 6.8059 4.2594 5.2213 4.3792 4.7245 2.5638 2.3558 1.8091 1.9175 2.5279 2.1055 2.3624 1.3793 1.5753 2.8913 1.4778 1.7259 1.9529 1.9848 1.3338 1.3379 6.4379 2.2220 2.3251 2.0950 1.9905 1.9898 1.7985 2.7711 2.7014 1.5993 1.1165 1.1318 1.3004 2.4846 2.7132 1.5462 1.7659 1.5837 1.6328 1.7028 1.6942 1.4285 1.5191 7.5303 3.9885 3.9235 2.2540 2.6577 1.1093 1.0911 1.7107 1.3767 4.0018 6.5550 6.9433 7.0416 6.8070 1.7665 2.2435 12.5784 1.0644 1.0594 1.0657 1.0951 1.0967 1.1025 1.0869 1.0852 1.0880 1.0896 1.0940 1.0944 1.1002 1.1001 1.0468 1.1023
irintensity: 2.0385 0.8273 2.0676 1.2660 0.8431 6.2358 0.1415 0.3975 0.2686 2.8699 0.2945 0.3012 1.0464 0.2724 76.4639 32.9171 1.6648 6.2794 4.9662 41.5108 2.9255 1.0946 0.0758 91.9148 7.4020 1.0263 0.6014 8.3630 7.0461 8.5302 1.5526 2.5931 2.3502 52.8487 23.4439 8.4478 75.3130 0.3825 4.3281 4.3461 0.7032 0.1325 2.0207 1.9710 1.7272 2.7421 2.5883 0.0389 0.2483 3.0529 3.4027 10.1574 2.4605 0.8261 9.1024 0.3595 0.8278 0.9595 0.2002 0.1115 0.6098 3.5798 23.3638 21.9303 2.1043 2.5174 7.3324 8.6041 1.7578 1.3240 1.0579 6.7703 9.4295 4.1448 44.8936 24.3142 19.2514 16.3601 14.3731 6.1404 12.3272 3.6313 0.7966 0.4849 2.2238 1.3985 49.7085 257.1340 112.4096 23.8510 37.9763 15.8192 30.3176 10.9001 26.3556 7.9499 2.4667 3.8339 4.7090 21.1763 32.1736 52.6594 18.3366 57.9129 33.7660
temp: 298.150 k
press: 1.00000 atm
elementType: 7 7 6 6 6 6 6 6 6 6 6 6 6 6 6 6 6 6 6 6 6 1 1 1 1 1 1 1 1 1 1 1 1 1 1 1 1
symmnumber: 1
zpe: 779103.0 jmol-1
zpe.correction: 0.296745 hartree
zpe.thermalcorrener: 0.313691 hartree
zpe.thermalcorrenthalpy: 0.314636 hartree
zpe.thermalcorrgfe: 0.252612 hartree
zpe.sumelectzpe: -841.691548 hartree
zpe.sumelectthermal: -841.674601 hartree
zpe.sumelectthermalent: -841.673657 hartree
zpe.sumelectthermalfe: -841.735680 hartree
dipole: -1.3447 0.9307 5.1503
dipole: 5.4037
quadrupole: -118.0130 -113.9902 -130.4188
quadrupole: 6.8684 24.5254 -4.2637
quadrupole: 2.7943 6.8171 -9.6115 6.8684 24.5254 -4.2637
hfenergy: -841.9882923 hartree
pointgroup: C01 [X(C19H16N2)]
dipole: 0.5911861 -0.3482771 2.0122301 debye
polarizability: 260.0981308|19.1582721|237.9517597|-3.7746151|-2.4867783|147.681595 unknown
InChI: InChI=1S/C19H16N2/c20-12-13-11-19(10-9-18(13)21)16-7-3-1-5-14(16)15-6-2-4-8-17(15)19/h1-8H,9-11,21H2
charge 0 multiplicity 1
37 atoms
N  -4.249472 -0.053759 1.226963
N  -4.422069 0.84599 -2.214802
C  -0.057149 0.453435 0.260499
C  -0.576674 0.759881 1.706692
C  -1.111807 0.969546 -0.763916
C  0.308032 -1.032211 0.071244
C  1.30994 1.129574 0.073548
C  -1.925713 0.085868 2.016815
C  1.71879 -1.179122 -0.105621
C  2.338288 0.158978 -0.100868
C  -2.551985 0.631833 -0.380668
C  -2.937824 0.247333 0.897533
C  -0.523107 -2.16869 0.03018
C  1.6220 2.499842 0.098493
C  2.300209 -2.452766 -0.283267
C  3.684977 0.555423 -0.250437
C  0.059744 -3.448293 -0.154797
C  2.972974 2.901002 -0.055813
C  1.460894 -3.590488 -0.300541
C  3.995625 1.93495 -0.226718
C  -3.556546 0.75198 -1.386532
H  -0.680866 1.85792 1.804114
H  0.179315 0.435754 2.444814
H  -0.883491 0.551643 -1.761983
H  -1.003636 2.069441 -0.858563
H  -2.341562 0.508483 2.953684
H  -1.770341 -0.995801 2.203395
H  -1.611072 -2.075172 0.106374
H  0.8396 3.256723 0.229856
H  3.382141 -2.562096 -0.417753
H  4.478993 -0.18718 -0.386936
H  -0.582304 -4.335358 -0.193403
H  3.230078 3.965974 -0.044996
H  1.89378 -4.587231 -0.440942
H  5.034475 2.26279 -0.344533
H  -4.501073 -0.307408 2.177912
H  -4.987165 -0.001389 0.525072
