program: Gaussian 09
title: 000246949
version: EM64L-G09RevD.01
frameworkgroup: C1[X(C23H28N2O2)]
method: RPBEPBE
basis: SDD
operation: Freq
keyword: #p
keyword: freq=noraman
keyword: PBEPBE/SDD
title: #p freq=noraman PBEPBE/SDD
converged: YES YES NO NO
title: Mulliken charges:
elementType: O O N N C C C C C C C C C C C C C C C C C C C C C C C H H H H H H H H H H H H H H H H H H H H H H H H H H H H
charge: -0.244128 -0.219881 -0.169133 -0.108409 -0.324516 -0.191674 -0.375556 0.257418 -0.448421 0.537502 -0.349603 -0.363420 -0.549119 0.349683 0.243209 -0.314551 -0.334836 -0.356841 -0.395124 -0.405484 -0.427505 -0.820457 -0.263512 -0.276389 -0.237676 -0.262860 -0.243014 0.261898 0.220233 0.213959 0.245764 0.202876 0.225228 0.203156 0.200016 0.257508 0.225713 0.210532 0.226339 0.185049 0.214134 0.219036 0.206668 0.216284 0.229263 0.220413 0.227014 0.250264 0.257689 0.245267 0.221063 0.224120 0.227920 0.226105 0.230784
chargesum: 0.00000
title: Mulliken charges with hydrogens summed into heavy atoms:
elementType: O O N N C C C C C C C C C C C C C C C C C C C C C C C
charge: -0.244128 -0.219881 -0.169133 -0.108409 -0.062617 0.028559 0.084167 0.257418 -0.020317 0.537502 0.053569 0.119802 -0.112248 0.349683 0.243209 0.084632 0.090868 -0.140557 -0.165862 -0.185071 -0.200491 -0.067237 -0.042448 -0.052269 -0.009757 -0.036755 -0.012230
polarizability: 3.15620882e+02 2.40736491e+01 2.41975084e+02 1.11453104e+01 2.96706333e+01 2.40000658e+02
1716.lowfreq: -12.8878 -7.8155 -6.3698 -0.0006 0.0003 0.0006 14.4420 18.4194 31.0223
frequency: 9.0485 17.5977 30.9489 39.1613 46.9332 60.3928 76.2192 81.6064 98.6465 116.6568 127.5143 132.8016 148.1293 177.2177 199.5240 203.0453 227.1435 233.5291 234.5016 265.9211 304.5655 311.8309 317.9540 339.9964 384.2256 401.2636 404.1916 413.4180 430.9571 458.3728 462.3964 478.4713 495.9997 524.5357 536.8582 552.5875 582.7633 600.1088 609.4089 624.2352 639.7735 653.2984 700.7568 705.9264 719.5089 744.9266 751.9138 775.0907 796.9806 803.9183 827.9481 837.1221 846.8564 849.0599 863.2995 881.7768 887.3356 904.5462 918.9434 928.5886 932.0472 945.7231 963.1144 973.0841 990.2798 991.5715 995.2235 999.2909 1015.3345 1022.1155 1028.4071 1046.3774 1046.8227 1056.3833 1063.8906 1077.0919 1079.2965 1088.3594 1094.7579 1121.9455 1133.4265 1144.6484 1153.6948 1169.7270 1173.8503 1175.1989 1184.6212 1192.4964 1193.7220 1196.1103 1199.5495 1210.4032 1239.1708 1251.6933 1261.5775 1273.4871 1280.0877 1290.4504 1301.7292 1319.1741 1327.4132 1334.2565 1337.2064 1346.4561 1350.2859 1357.6796 1362.4577 1369.6159 1370.8043 1378.8787 1384.1750 1387.3006 1401.0812 1440.0779 1440.4093 1442.2752 1447.0681 1447.7524 1448.9539 1453.9941 1456.9126 1458.0659 1469.4000 1482.6253 1487.5802 1502.9599 1576.6523 1590.6553 1608.3233 1610.7380 1615.4672 2882.0432 2923.5316 2928.4811 2943.5871 2954.1706 2965.2252 2973.9968 2995.0592 3010.0713 3017.6801 3021.8591 3037.8191 3055.4401 3062.0288 3071.3363 3075.0511 3075.7803 3090.1379 3110.4621 3116.3540 3118.9589 3124.5966 3125.6211 3136.6504 3146.2397 3150.7393 3164.0737 3164.4770
redmass: 3.7531 4.4588 4.8732 4.0501 3.7257 4.6898 4.7384 3.5918 4.4206 3.1738 3.0441 1.0993 4.5024 3.6970 3.7712 4.5141 3.0423 4.2885 2.9003 3.7156 3.3385 3.2678 2.2177 3.6578 1.9150 2.9197 3.8093 3.2244 4.8317 3.9877 2.8364 4.5749 3.2873 3.4799 3.5629 2.4715 3.7242 3.9659 4.4241 5.0529 3.3277 2.5966 2.6277 2.0748 2.3057 1.6143 3.4908 2.6193 3.4310 3.8518 1.6140 1.6729 2.4503 1.2700 3.4069 1.5225 2.3831 2.2982 1.5692 1.7772 1.6445 2.0817 1.3053 1.3973 3.5196 3.3690 1.3730 2.6257 2.1734 2.2208 2.2591 2.4304 2.3275 2.3018 2.2834 3.3138 1.7038 2.2904 2.1374 2.0706 2.5724 2.9041 1.8699 1.6656 1.1085 1.1836 1.5826 1.1149 1.2194 1.4872 2.1507 2.4479 1.2418 1.7131 1.4427 1.2492 1.5053 1.4055 1.3937 1.5651 1.2779 1.3541 1.3719 1.3389 1.4252 1.4271 1.3494 1.3047 1.2598 4.4590 3.6977 1.3823 1.7263 1.1656 1.5047 1.2424 1.0975 1.1089 1.9408 1.0545 1.1063 1.2671 1.1101 2.1349 1.3440 1.8593 6.5114 5.8408 6.8546 6.1107 6.4507 1.0680 1.0698 1.0657 1.0665 1.0666 1.0661 1.0371 1.0703 1.0842 1.0887 1.0857 1.0933 1.0958 1.1042 1.0885 1.0855 1.0962 1.0978 1.0879 1.0997 1.0847 1.0870 1.0869 1.0913 1.0959 1.0914 1.1011 1.0994
irintensity: 0.3080 0.0496 0.2545 0.6481 0.6188 0.3548 2.5769 3.6086 0.8239 0.5003 1.4669 0.3063 2.2612 0.3219 4.3541 5.3750 1.6659 4.8457 1.4582 0.9949 13.5527 0.6523 6.4997 11.0661 0.5872 0.5730 0.7451 0.2542 7.4185 2.5116 0.7757 6.1044 2.4893 28.4357 0.7354 10.4018 1.8848 7.4792 2.6021 0.5591 17.6305 14.2234 16.6760 43.4221 8.6357 78.3675 7.0068 18.5506 13.9859 15.1106 2.6300 0.5239 6.8446 0.7181 7.7119 8.0296 19.0619 11.8875 1.9021 7.0973 5.0800 11.9137 0.0592 0.7260 10.0249 21.0418 0.4968 7.5136 1.1893 10.4532 5.9855 11.7443 3.1993 9.0000 21.3497 53.1724 2.4125 4.5976 1.5326 3.4930 26.1185 26.5161 47.1397 12.8249 1.0823 2.6619 8.1746 1.9962 5.0619 36.3154 9.0024 9.9975 42.0897 102.6552 12.3022 15.1676 36.9159 7.7124 3.9862 67.6551 4.9224 1.0721 1.0870 14.5287 1.2559 2.3894 23.4049 3.0971 40.1457 10.4763 2.4717 9.1745 1.0596 1.5250 0.3683 16.9675 5.5329 18.8540 28.8695 13.3875 15.8440 9.8309 10.3729 7.5763 44.0286 129.9720 7.6486 4.2024 71.0957 10.5695 108.7411 83.8726 44.8351 52.8120 57.1843 38.0335 64.8955 3.5339 12.4521 53.3115 5.8405 55.4181 47.3064 9.2422 42.6054 6.1154 11.2419 39.9130 29.3141 18.6471 14.1686 10.1394 10.0396 3.5815 20.5528 40.4100 38.7811 24.9546 19.0383
temp: 298.150 k
press: 1.00000 atm
elementType: 8 8 7 7 6 6 6 6 6 6 6 6 6 6 6 6 6 6 6 6 6 6 6 6 6 6 6 1 1 1 1 1 1 1 1 1 1 1 1 1 1 1 1 1 1 1 1 1 1 1 1 1 1 1 1
symmnumber: 1
zpe: 1213032.4 jmol-1
zpe.correction: 0.462020 hartree
zpe.thermalcorrener: 0.486923 hartree
zpe.thermalcorrenthalpy: 0.487867 hartree
zpe.thermalcorrgfe: 0.404665 hartree
zpe.sumelectzpe: -1151.163520 hartree
zpe.sumelectthermal: -1151.138617 hartree
zpe.sumelectthermalent: -1151.137672 hartree
zpe.sumelectthermalfe: -1151.220874 hartree
dipole: 2.5104 0.5604 4.0275
dipole: 4.7788
quadrupole: -160.1585 -162.0155 -156.0617
quadrupole: 6.7130 2.3158 10.5745
quadrupole: -0.7466 -2.6036 3.3502 6.7130 2.3158 10.5745
hfenergy: -1151.6255393 hartree
pointgroup: C01 [X(C23H28N2O2)]
dipole: 0.1147845 0.6761797 -1.7505575 debye
polarizability: 238.0225161|7.0579436|311.9416285|-29.7636026|-29.8453723|247.6324804 unknown
InChI: InChI=1S/C23H28N2O2/c1-18(26)22(24-14-16-27-17-15-24)23(20-9-3-2-4-10-20)25-13-7-11-19-8-5-6-12-21(19)25/h2-6,8-10,12,22-23H,7,11,13-17H2,1H3
charge 0 multiplicity 1
55 atoms
O  3.597822 -2.87256 0.667704
O  1.977706 1.979907 1.808478
N  -0.795549 -0.305764 -0.475975
N  2.057403 -0.532846 -0.023054
C  -0.059888 0.865751 0.044596
C  1.472344 0.80856 -0.276332
C  -0.64575 -0.563397 -1.92389
C  -1.436198 -1.233435 0.374391
C  -1.666969 -1.586313 -2.445629
C  -0.694826 2.192701 -0.415288
C  3.354388 -0.810626 -0.685762
C  2.033961 -1.061592 1.365161
C  -1.585724 -2.866025 -1.589418
C  -1.835633 -2.52057 -0.129327
C  2.209083 1.883286 0.569519
C  3.595674 -2.332713 -0.698022
C  2.310001 -2.574788 1.323977
C  -1.724993 -0.937577 1.743443
C  -1.749354 2.744469 0.358217
C  -0.311173 2.871948 -1.601277
C  -2.476066 -3.439153 0.72817
C  3.274862 2.719701 -0.118066
C  -2.347546 -1.88297 2.583403
C  -2.728379 -3.149291 2.088405
C  -2.40251 3.930791 -0.036617
C  -0.964026 4.059933 -2.003932
C  -2.012533 4.594845 -1.223731
H  -0.121614 0.851441 1.143928
H  1.651664 1.014498 -1.347495
H  0.380946 -0.936358 -2.132536
H  -0.775675 0.395899 -2.461154
H  -1.445314 -1.80069 -3.507673
H  -2.687839 -1.1638 -2.391485
H  4.215166 -0.325175 -0.164658
H  3.32032 -0.431818 -1.725895
H  1.041082 -0.896204 1.81367
H  2.787591 -0.558212 2.012601
H  -0.579796 -3.319636 -1.715927
H  -2.319685 -3.618539 -1.931294
H  2.800401 -2.82618 -1.299376
H  4.586713 -2.575894 -1.116805
H  2.399123 -2.986542 2.342307
H  1.485762 -3.086725 0.783095
H  -1.489122 0.04301 2.167141
H  -2.061858 2.237547 1.278636
H  0.500514 2.482657 -2.227232
H  -2.778042 -4.410089 0.31408
H  2.813327 3.328884 -0.918957
H  3.770607 3.384085 0.606894
H  4.030892 2.071106 -0.601588
H  -2.546757 -1.615053 3.62764
H  -3.219066 -3.88271 2.73613
H  -3.210923 4.339398 0.579859
H  -0.652972 4.565962 -2.92506
H  -2.517271 5.51676 -1.533191
