program: Gaussian 09
title: 000246887
version: EM64L-G09RevD.01
frameworkgroup: C1[X(C19H14ClN)]
method: RPBEPBE
basis: SDD
operation: Freq
keyword: #p
keyword: freq=noraman
keyword: PBEPBE/SDD
title: #p freq=noraman PBEPBE/SDD
converged: YES YES NO NO
title: Mulliken charges:
elementType: Cl N C C C C C C C C C C C C C C C C C C C H H H H H H H H H H H H H H
charge: -0.065339 -0.002683 0.334280 0.276965 -0.405997 -0.078043 0.544871 -0.404316 -0.376868 -0.306185 -0.324563 -0.368629 -0.235532 -0.234177 -0.245788 -0.248481 -0.250869 -0.194934 -0.233008 -0.381401 -0.177727 0.245682 0.248182 0.251864 0.264844 0.251005 0.226996 0.226878 0.230414 0.253723 0.229846 0.239767 0.233242 0.244014 0.231965
chargesum: 0.00000
title: Mulliken charges with hydrogens summed into heavy atoms:
elementType: Cl N C C C C C C C C C C C C C C C C C C C
charge: -0.065339 -0.002683 0.334280 0.276965 -0.160314 -0.078043 0.544871 -0.156134 -0.125004 -0.041341 -0.324563 -0.117624 -0.008536 -0.007299 -0.015375 0.005242 -0.021023 0.044833 0.000235 -0.137388 0.054238
polarizability: 3.26774640e+02 1.25045348e+01 2.46198617e+02 -8.42672895e-01 -5.86594441e-01 1.37800476e+02
1716.lowfreq: -6.4974 -5.7286 -0.0007 0.0006 0.0009 2.2150 19.9019 32.6509 48.0317
frequency: 19.6213 32.5328 48.0188 58.4391 63.8982 71.5807 125.8783 142.1128 186.2008 213.6616 217.5454 248.9536 296.6960 321.9169 373.5663 396.6404 404.5903 408.6465 440.4025 461.7289 473.9652 530.0152 563.5183 587.0398 612.3610 618.6131 644.1562 646.0200 678.4630 701.5813 716.8780 742.1831 749.7661 760.7219 767.5842 801.4407 831.8715 852.9476 861.1728 880.2654 902.3014 923.4703 934.0739 950.7908 960.0917 964.3290 978.1109 984.7471 988.2936 995.3399 1001.5947 1015.3975 1029.0053 1038.4052 1041.6636 1085.9691 1086.7755 1121.5332 1163.4517 1165.2120 1172.1474 1173.3371 1194.5744 1221.8782 1261.8473 1279.5319 1288.4892 1302.9956 1319.5731 1354.8240 1372.9351 1384.5270 1403.7889 1424.8531 1434.2184 1450.0554 1459.4040 1482.6437 1552.3431 1563.3684 1572.5160 1578.6764 1599.7518 1604.1561 1615.9194 3110.8804 3122.9279 3125.1201 3128.7120 3134.6621 3138.2331 3141.2280 3149.4175 3149.9607 3155.7237 3164.1031 3164.6448 3170.2762 3175.2258
redmass: 6.3900 5.1613 4.8977 4.8608 4.8393 4.9464 5.9846 5.1277 5.9346 5.2778 5.3366 4.9559 5.3874 4.9572 6.1607 5.0304 4.0568 3.0145 3.7160 3.4919 3.6641 3.7092 5.9313 5.1292 5.8550 6.5884 3.8949 5.4654 6.3826 1.7536 4.3811 2.8327 1.5551 1.5098 1.9486 2.9370 4.2128 1.2764 1.3366 1.5505 1.3164 1.7339 2.5984 1.5143 1.8578 3.4330 1.4323 1.3437 5.2109 1.3169 1.3362 7.0664 2.2205 2.3707 2.0586 1.6116 1.6509 1.8210 2.2522 1.0782 1.1651 1.0649 1.1178 1.6643 2.4662 2.0207 1.8090 4.5445 1.3801 2.9152 5.3337 2.7860 1.8140 2.3509 2.2810 2.2644 2.6449 2.3262 5.3466 5.9174 5.6887 5.7234 6.7532 6.5686 7.3420 1.0873 1.0845 1.0882 1.0874 1.0855 1.0890 1.0921 1.0964 1.0904 1.0943 1.0953 1.1016 1.1016 1.0998
irintensity: 0.2062 0.4773 0.7333 0.9136 0.0708 1.6134 0.6465 0.4488 0.3839 0.2490 1.5997 1.6214 1.0294 1.0688 2.3070 5.4728 2.2967 0.4911 3.6861 8.2252 0.2206 2.2285 9.2079 21.6783 1.1143 1.0094 5.5413 4.7530 25.7900 49.5579 3.0018 11.7378 48.3622 51.9128 47.4432 32.1091 2.3775 0.6264 3.2360 15.3864 0.2391 4.3658 2.6997 5.8557 1.3588 6.0787 0.9697 0.5928 0.2575 0.1980 0.1960 55.2058 6.6608 3.5085 6.1812 6.4309 5.4577 5.5333 2.6118 0.9873 0.1582 0.0414 1.0558 0.9140 1.2445 2.7137 0.6982 0.7550 2.3004 6.1290 0.6558 12.1153 8.7939 26.8854 14.8642 28.1379 13.6736 26.3111 12.3740 7.8657 38.3973 1.2518 4.7356 6.2278 7.5983 17.2733 3.5784 12.3927 0.5961 1.0884 6.4125 15.9884 38.0986 11.4229 22.7135 14.7359 29.2919 21.4015 17.6231
temp: 298.150 k
press: 1.00000 atm
elementType: 17 7 6 6 6 6 6 6 6 6 6 6 6 6 6 6 6 6 6 6 6 1 1 1 1 1 1 1 1 1 1 1 1 1 1
symmnumber: 1
zpe: 705696.4 jmol-1
zpe.correction: 0.268786 hartree
zpe.thermalcorrener: 0.286076 hartree
zpe.thermalcorrenthalpy: 0.287020 hartree
zpe.thermalcorrgfe: 0.221099 hartree
zpe.sumelectzpe: -1245.787025 hartree
zpe.sumelectthermal: -1245.769734 hartree
zpe.sumelectthermalent: -1245.768790 hartree
zpe.sumelectthermalfe: -1245.834711 hartree
dipole: -1.3301 3.0534 -2.1759
dipole: 3.9783
quadrupole: -111.0345 -113.9271 -130.5685
quadrupole: 3.2538 -1.8534 2.2396
quadrupole: 7.4755 4.5830 -12.0584 3.2538 -1.8534 2.2396
hfenergy: -1246.0558101 hartree
pointgroup: C01 [X(C19H14Cl1N1)]
dipole: 0.0908233 1.2434801 0.9462145 debye
polarizability: 326.0887321|13.9393978|246.1895391|5.2385732|8.1113583|138.4954613 unknown
InChI: InChI=1S/C19H14ClN/c20-18-11-5-4-10-16(18)14-17(15-8-2-1-3-9-15)19-12-6-7-13-21-19/h1-14H
charge 0 multiplicity 1
35 atoms
Cl -1.577708 -3.617374 -1.433187
N  -0.821195 1.508601 -1.011279
C  0.620361 -0.158848 0.0737
C  2.099138 -0.357117 0.152254
C  -0.21359 -1.255487 0.06748
C  0.120262 1.249124 -0.042759
C  -1.680615 -1.306372 0.18283
C  2.655505 -1.430135 0.906542
C  2.993652 0.510215 -0.53769
C  0.62265 2.27525 0.805608
C  -2.431804 -2.358434 -0.410005
C  -2.42341 -0.378521 0.974444
C  4.049396 -1.641684 0.950258
C  4.387828 0.299447 -0.49316
C  4.924111 -0.778603 0.249337
C  -3.825751 -2.486048 -0.270686
C  -3.816992 -0.486193 1.134824
C  0.124182 3.589204 0.675506
C  -4.526499 -1.538229 0.507557
C  -1.285489 2.783801 -1.127946
C  -0.853895 3.85512 -0.310317
H  0.267469 -2.237813 -0.029004
H  1.988924 -2.083715 1.480572
H  2.590133 1.337367 -1.132092
H  1.382245 2.033707 1.555657
H  -1.878646 0.422668 1.482818
H  4.454588 -2.470943 1.541072
H  5.055914 0.971433 -1.043546
H  6.007164 -0.940183 0.286204
H  -4.351149 -3.310145 -0.761732
H  -4.350748 0.24247 1.754159
H  0.49123 4.38761 1.329298
H  -5.611401 -1.629253 0.62572
H  -2.031184 2.945808 -1.915372
H  -1.266176 4.859475 -0.450268
