program: Gaussian 09
title: 000246903
version: EM64L-G09RevD.01
frameworkgroup: C1[X(C21H23NO2)]
method: RPBEPBE
basis: SDD
operation: Freq
keyword: #p
keyword: freq=noraman
keyword: PBEPBE/SDD
title: #p freq=noraman PBEPBE/SDD
converged: YES YES NO NO
title: Mulliken charges:
elementType: O O N C C C C C C C C C C C C C C C C C C C C C H H H H H H H H H H H H H H H H H H H H H H H
charge: -0.283743 -0.232623 -0.648701 0.077845 -0.523066 -0.457732 -0.156464 -0.092347 -0.503486 0.335975 0.196309 0.123467 0.124183 0.188919 -0.448043 -0.367520 -0.401991 -0.408751 -0.254965 -0.290930 -0.239934 -0.234691 -0.256533 -0.665149 0.260385 0.242951 0.230021 0.223604 0.246228 0.221693 0.224712 0.208939 0.254858 0.219624 0.264638 0.291496 0.239153 0.240430 0.223451 0.223353 0.224538 0.226077 0.237194 0.221582 0.219411 0.218376 0.257258
chargesum: 0.00000
title: Mulliken charges with hydrogens summed into heavy atoms:
elementType: O O N C C C C C C C C C C C C C C C C C C C C C
charge: -0.283743 -0.232623 -0.092566 0.077845 -0.019730 -0.004108 0.089764 0.129345 -0.069835 0.335975 0.196309 0.123467 0.124183 0.188919 -0.193186 -0.147896 -0.162837 -0.168321 -0.031514 -0.067577 -0.015396 -0.008614 0.202243 0.029896
polarizability: 2.73936051e+02 1.78018344e+00 2.74834494e+02 2.86024275e+01 -2.23278214e+00 1.63868418e+02
1716.lowfreq: -6.2619 -4.6149 -0.0009 -0.0007 -0.0001 7.3511 13.5504 34.7388 47.6358
frequency: 13.2110 34.6532 47.6246 71.3783 74.6220 92.2006 101.7360 133.8790 140.6897 161.8252 187.9770 200.7399 224.7550 236.9470 248.0861 270.0711 296.7289 308.3903 319.1171 326.1696 357.5354 385.0607 405.1378 412.1295 426.9966 428.5949 485.9458 508.8822 525.1686 548.6355 567.3053 575.1232 590.2487 616.9241 625.6221 660.1551 689.1628 712.3062 738.2676 743.8266 752.7401 756.1743 763.5009 768.3326 796.6177 813.9119 824.8204 832.6172 861.1725 872.5227 878.7574 917.0897 922.8059 934.6890 941.0033 948.9699 978.9548 981.9069 984.4980 996.6417 1003.8304 1014.8033 1025.5889 1033.0847 1052.1617 1081.2497 1083.0570 1095.8256 1101.4954 1109.6535 1127.8359 1145.2572 1154.1115 1160.1835 1161.8301 1170.1456 1178.7947 1197.4940 1217.0323 1239.8832 1242.3968 1257.8322 1267.7729 1278.3624 1288.5394 1305.5291 1312.7501 1325.9470 1339.9926 1345.6432 1354.3586 1364.6916 1372.1921 1377.5866 1391.3393 1401.8564 1434.8707 1441.2710 1444.8253 1454.9642 1456.3288 1464.4778 1468.5597 1475.2917 1482.2750 1484.6730 1585.6824 1593.3595 1614.1960 1618.8546 1623.3563 1639.9030 2904.2991 2973.4068 2977.0018 2991.7817 3000.0161 3010.2533 3029.7589 3035.6595 3061.0322 3078.0424 3084.0628 3094.0022 3117.4987 3118.3457 3121.3578 3125.6207 3131.1944 3139.2124 3144.8486 3158.6572 3160.8282 3441.4912 3566.7102
redmass: 4.7372 4.3481 4.2984 3.7668 4.2871 3.9887 4.0581 3.6296 3.2961 4.8552 3.4192 3.1484 1.3931 4.2435 2.9103 3.5314 1.1049 3.4794 2.6136 2.5167 3.9723 2.7142 3.2405 6.0565 3.1612 3.3166 2.9531 5.2404 3.3782 3.4000 3.5844 3.4797 3.7100 6.6975 4.1458 2.3759 5.4861 2.8252 2.2712 2.1440 4.0763 1.5161 1.7323 2.2129 2.5733 1.4739 2.6987 2.9862 2.8780 1.4395 1.5496 2.5912 2.7751 2.5053 1.4631 1.4440 2.1103 1.3319 1.3175 6.8961 2.5673 3.0417 2.1459 2.1293 1.8703 2.4834 2.1181 2.1659 2.0186 1.8413 1.4963 3.0106 1.6780 1.7337 2.0467 1.1463 1.1803 2.5836 1.4766 1.6438 1.4188 1.9353 1.2742 1.1224 1.4534 1.8820 1.5172 1.2907 1.3991 1.5003 1.2706 1.4855 1.7201 4.6189 1.2334 4.0512 2.2506 2.5804 1.0895 1.2398 1.0946 1.0446 1.9623 1.1295 3.7601 1.0520 6.3446 7.0465 7.2655 6.9393 2.5537 1.6148 1.0826 1.0775 1.0667 1.0362 1.0602 1.0598 1.0590 1.0968 1.1020 1.1032 1.0982 1.1027 1.0859 1.1058 1.0849 1.0887 1.0894 1.0942 1.0941 1.1002 1.1001 1.0449 1.0964
irintensity: 1.2805 0.1885 0.1821 1.7399 0.6065 0.5022 1.4974 0.6999 0.6925 0.4074 0.7015 1.2526 3.1131 1.2435 2.2720 1.3666 54.0136 1.8766 5.6373 6.6442 5.2178 2.1039 3.8802 1.7734 4.8688 3.6315 0.5704 0.4260 7.2216 1.2361 3.7437 2.5234 21.9978 3.1266 34.5618 42.4207 1.7915 23.5630 31.6462 78.2185 12.6902 1.0588 86.9491 15.3837 0.3016 1.0100 11.6823 1.5373 6.3099 1.0213 1.0401 5.4005 32.8469 4.5113 1.0332 0.8331 9.6951 0.1533 0.0208 3.5383 7.5242 114.1580 5.5040 9.5777 3.6893 1.1709 3.9182 33.6194 20.5814 1.1861 16.3654 161.7028 12.3618 6.9962 115.0541 21.2294 1.2786 38.6102 7.2075 3.5894 3.5794 19.8779 5.3004 2.3951 3.3118 1.0045 0.2842 0.1647 2.0328 6.4334 0.3708 11.6817 4.6295 9.0644 25.5488 0.5296 24.0413 20.1315 11.2950 1.1852 15.0143 14.7223 11.7689 18.0285 3.5228 13.9761 0.4008 0.3487 1.6993 1.1077 194.2101 18.3154 66.3787 13.4685 55.8520 19.1206 34.6800 8.0246 34.8233 21.6212 31.0811 9.4014 36.5000 5.9027 4.0918 30.6990 3.4658 4.1283 5.5063 22.1200 52.8741 52.8812 22.0004 5.7684 4.4645
temp: 298.150 k
press: 1.00000 atm
elementType: 8 8 7 6 6 6 6 6 6 6 6 6 6 6 6 6 6 6 6 6 6 6 6 6 1 1 1 1 1 1 1 1 1 1 1 1 1 1 1 1 1 1 1 1 1 1 1
symmnumber: 1
zpe: 1024898.4 jmol-1
zpe.correction: 0.390363 hartree
zpe.thermalcorrener: 0.411577 hartree
zpe.thermalcorrenthalpy: 0.412521 hartree
zpe.thermalcorrgfe: 0.339642 hartree
zpe.sumelectzpe: -1017.518915 hartree
zpe.sumelectthermal: -1017.497702 hartree
zpe.sumelectthermalent: -1017.496757 hartree
zpe.sumelectthermalfe: -1017.569636 hartree
dipole: 2.4310 0.2115 2.2698
dipole: 3.3326
quadrupole: -117.0271 -132.0006 -145.8102
quadrupole: -1.4040 7.8325 0.0049
quadrupole: 14.5855 -0.3879 -14.1976 -1.4040 7.8325 0.0049
hfenergy: -1017.9092785 hartree
pointgroup: C01 [X(C21H23N1O2)]
dipole: -0.953694 -0.0393222 0.8989146 debye
polarizability: 273.7342798|1.288971|274.8055908|-29.1358574|1.0305252|164.0990924 unknown
InChI: InChI=1S/C21H23NO2/c1-2-24-20(23)16-13-21(12-11-19(16)22)17-9-5-3-7-14(17)15-8-4-6-10-18(15)21/h3-10,16,19H,2,11-13,22H2,1H3
charge 0 multiplicity 1
47 atoms
O  -4.371877 -0.318917 -0.073903
O  -3.074778 -0.371121 -2.006449
N  -2.729956 0.983775 1.940748
C  0.538252 0.070194 0.52894
C  -0.775033 0.279778 -0.296455
C  0.216301 0.198422 2.057055
C  -1.955964 -0.605537 0.182507
C  -2.263433 -0.401172 1.693399
C  -0.976336 -0.669923 2.512409
C  1.568883 1.136721 0.123247
C  1.29414 -1.229355 0.170815
C  2.753661 0.541154 -0.393738
C  2.585071 -0.922359 -0.366558
C  -3.146838 -0.41087 -0.75705
C  1.456665 2.535435 0.211281
C  0.910347 -2.58014 0.299059
C  3.835639 1.340631 -0.824032
C  3.473157 -1.942107 -0.770569
C  2.540411 3.341234 -0.219146
C  1.800524 -3.607064 -0.107017
C  3.72093 2.747237 -0.732479
C  3.073256 -3.291542 -0.638987
C  -5.595941 -0.176654 -0.926365
C  -5.851735 1.292301 -1.273744
H  -0.581876 0.094614 -1.367221
H  -1.083258 1.334907 -0.181575
H  -0.023454 1.258443 2.259955
H  1.119855 -0.055897 2.642211
H  -1.670785 -1.670014 0.042052
H  -3.025027 -1.159018 1.990505
H  -0.720774 -1.743889 2.443683
H  -1.183832 -0.473322 3.584217
H  0.546646 3.004241 0.603993
H  -0.062952 -2.863794 0.710813
H  -2.682597 1.251308 2.930163
H  -3.662449 1.148705 1.545713
H  4.749649 0.886028 -1.222958
H  4.459036 -1.695577 -1.180963
H  2.466083 4.432852 -0.15676
H  1.497747 -4.655594 -0.007547
H  4.549099 3.385214 -1.061442
H  3.749131 -4.096582 -0.948689
H  -5.455872 -0.783316 -1.837971
H  -6.397053 -0.603721 -0.301727
H  -6.792376 1.379977 -1.848771
H  -5.949665 1.907381 -0.361927
H  -5.03242 1.694735 -1.892028
