program: Gaussian 09
title: 000246864
version: EM64L-G09RevD.01
frameworkgroup: C1[X(C11H10INO5)]
method: RPBEPBE
basis: SDD
operation: Freq
keyword: #p
keyword: freq=noraman
keyword: PBEPBE/SDD
title: #p freq=noraman PBEPBE/SDD
converged: YES YES NO NO
title: Mulliken charges:
elementType: I O O O O O N C C C C C C C C C C C H H H H H H H H H H
charge: 0.052291 -0.296713 -0.442778 -0.258114 -0.230975 -0.196601 -0.424109 0.547323 0.333689 0.153974 -0.609073 -0.366183 -0.300624 0.132627 0.275537 -0.841913 0.268974 -0.749142 0.256486 0.311224 0.282913 0.302272 0.321003 0.320640 0.280972 0.242716 0.245543 0.388040
chargesum: 0.00000
title: Mulliken charges with hydrogens summed into heavy atoms:
elementType: I O O O O O N C C C C C C C C C C C
charge: 0.052291 -0.296713 -0.054738 -0.258114 -0.230975 -0.196601 -0.121836 0.547323 0.333689 0.153974 -0.352586 -0.054959 -0.017711 0.132627 0.275537 -0.200270 0.268974 0.020088
polarizability: 2.69005781e+02 1.89152078e+00 1.92186306e+02 3.78460938e+00 1.07142391e+01 8.17957083e+01
1716.lowfreq: -2.0293 -0.0006 -0.0005 -0.0004 3.9159 5.7104 17.2781 37.0548 52.2125
frequency: 17.1861 37.0460 52.2038 54.2938 58.5020 85.4760 91.6139 100.1025 110.7120 123.3594 135.7868 215.9148 246.9106 260.0749 284.8313 305.2184 324.7349 350.6554 395.2089 449.0586 486.3676 512.5293 530.1583 538.1069 553.3179 571.2508 602.2038 609.2719 643.2551 674.2672 686.6155 708.3469 733.4351 748.8119 774.9894 821.9589 836.6146 874.9246 894.6485 911.2109 982.9393 989.2042 1001.6558 1006.7966 1037.9495 1106.1921 1143.0878 1149.1795 1170.1499 1175.3908 1201.2837 1223.5221 1249.2171 1308.9891 1319.6435 1373.4365 1378.2309 1409.1498 1418.3612 1448.7646 1454.8160 1497.3811 1515.4709 1585.5607 1600.2131 1627.2445 1638.4416 1701.3491 3010.9538 3066.7611 3105.0714 3143.8645 3147.6997 3149.1441 3180.0377 3203.4822 3437.8219 3535.3748
redmass: 6.5263 8.1540 7.1904 7.6259 3.4995 3.8877 3.2942 1.4220 4.8512 9.3035 6.3315 8.0043 6.3964 6.2754 8.4449 4.8386 5.5239 7.4138 7.8435 2.9921 5.3503 3.9284 3.8716 4.3385 3.7091 1.7673 2.2510 5.1464 5.3109 4.8139 3.4204 4.1294 1.3969 5.4226 3.7482 6.1136 1.7519 1.4642 1.8010 6.0084 2.6083 3.2760 4.9119 1.3372 1.6387 2.4613 1.1463 2.3237 1.6990 1.8035 1.5807 1.8956 1.6459 2.0140 2.9889 3.7770 1.3462 1.1610 4.1953 1.0575 1.0513 3.1584 2.8441 4.3745 4.8107 7.5942 8.2338 10.7649 1.0364 1.0566 1.0962 1.1022 1.1077 1.0926 1.0902 1.0962 1.0771 1.0642
irintensity: 0.8781 0.3934 1.2673 1.1005 11.0298 2.7627 3.9622 0.4905 1.4484 6.3244 0.6593 3.1452 0.4190 0.8804 1.2945 1.3900 4.5348 8.7036 19.5782 19.5890 1.5287 25.4405 22.9154 9.2085 13.1242 69.0014 56.5616 26.0839 54.6715 39.1952 64.7394 18.9069 40.7638 16.6553 4.2690 47.8404 21.9832 14.7548 75.7799 48.3760 45.8135 114.2724 294.3109 0.7247 12.1405 246.7363 0.1569 339.1312 111.1978 46.5642 16.6850 50.7496 5.1380 15.2701 176.3801 193.6653 40.1574 33.9596 26.2090 20.2408 22.2026 43.3833 756.1827 173.2546 234.4048 92.2042 398.8896 173.0665 1.2721 0.7520 5.4786 10.2956 0.3500 3.1017 1.4147 3.3929 153.6381 61.7074
temp: 298.150 k
press: 1.00000 atm
elementType: 53 8 8 8 8 8 7 6 6 6 6 6 6 6 6 6 6 6 1 1 1 1 1 1 1 1 1 1
symmnumber: 1
zpe: 515022.3 jmol-1
zpe.correction: 0.196162 hartree
zpe.thermalcorrener: 0.214261 hartree
zpe.thermalcorrenthalpy: 0.215205 hartree
zpe.thermalcorrgfe: 0.145811 hartree
zpe.sumelectzpe: -866.272146 hartree
zpe.sumelectthermal: -866.254047 hartree
zpe.sumelectthermalent: -866.253103 hartree
zpe.sumelectthermalfe: -866.322497 hartree
dipole: 1.3280 -1.0409 -1.5353
dipole: 2.2813
quadrupole: -110.5009 -114.0598 -125.4725
quadrupole: -4.2676 5.9762 1.9381
quadrupole: 6.1769 2.6180 -8.7948 -4.2676 5.9762 1.9381
hfenergy: -866.468308 hartree
pointgroup: C01 [X(C11H10I1N1O5)]
dipole: -0.3991544 -0.4500313 0.6661135 debye
polarizability: 264.091078|19.6917309|192.3432776|6.3638189|-24.1615345|86.5534391 unknown
InChI: InChI=1S/C11H10INO5/c1-6(14)18-9-4-7(13-10(15)5-12)2-3-8(9)11(16)17/h2-4,13,16H,5H2,1H3
charge 0 multiplicity 1
28 atoms
I  -5.086306 -2.793866 0.280198
O  2.007119 -1.402217 0.654384
O  2.847042 2.768789 -0.313496
O  3.796193 0.75446 0.317166
O  -3.945634 1.37122 -0.682836
O  2.953265 -1.582635 -1.48888
N  -2.659811 -0.513889 -0.095156
C  -1.338635 0.006151 -0.10296
C  1.039925 -0.454834 0.241157
C  1.37261 0.898437 -0.064039
C  -0.292291 -0.892595 0.225624
C  -1.033823 1.357154 -0.424933
C  0.305557 1.775975 -0.398936
C  2.764787 1.401625 0.005032
C  -3.840514 0.14707 -0.369908
C  -5.152693 -0.643647 -0.303169
C  3.029037 -1.814924 -0.274072
C  4.105825 -2.548234 0.476531
H  -0.496222 -1.940919 0.469273
H  -1.836496 2.049114 -0.682225
H  0.552375 2.81362 -0.63644
H  -2.756034 -1.508424 0.144327
H  -5.629603 -0.633118 -1.295002
H  -5.820527 -0.168956 0.431134
H  4.731569 -1.792664 0.98445
H  4.727043 -3.126618 -0.222551
H  3.673575 -3.204741 1.248554
H  3.800264 3.045666 -0.254427
