program: Gaussian 09
title: 000246848
version: EM64L-G09RevD.01
frameworkgroup: C1[X(C9H12N4O2)]
method: RPBEPBE
basis: SDD
operation: Freq
keyword: #p
keyword: freq=noraman
keyword: PBEPBE/SDD
title: #p freq=noraman PBEPBE/SDD
converged: YES YES NO NO
title: Mulliken charges:
elementType: O O N N N N C C C C C C C C C H H H H H H H H H H H H
charge: -0.157480 -0.233873 0.001290 -0.600092 -0.620024 -0.012399 0.234959 -0.373318 -0.255571 -0.752123 -0.723385 0.167333 -0.040242 0.221120 -0.193387 0.243311 0.341379 0.258578 0.201181 0.244868 0.258239 0.246177 0.203438 0.348885 0.324744 0.345708 0.320682
chargesum: 0.00000
title: Mulliken charges with hydrogens summed into heavy atoms:
elementType: O O N N N N C C C C C C C C C
charge: -0.157480 -0.233873 0.001290 0.073537 0.046367 -0.012399 0.234959 -0.130006 0.085808 -0.047496 -0.015531 0.167333 -0.040242 0.221120 -0.193387
polarizability: 1.67531578e+02 -1.70272458e+00 1.17385687e+02 -1.17501725e+01 -9.02517815e-01 9.47739576e+01
1716.lowfreq: -7.1022 -0.0008 -0.0005 -0.0001 8.3665 13.8179 35.7369 48.4736 78.9616
frequency: 35.7211 48.4015 78.9436 132.5031 143.8174 146.4019 176.9101 200.2652 225.1857 250.8170 273.2426 286.9182 306.0875 341.1259 348.0447 388.6902 412.0964 430.9543 448.7040 479.2433 504.8173 523.4808 542.5069 568.9071 607.4501 622.4852 635.9411 662.0810 694.4540 734.0952 805.4235 856.1826 860.3353 917.7204 946.3821 965.0161 974.9667 1012.3219 1014.7038 1047.1812 1055.3795 1134.9272 1164.0087 1202.6644 1214.1656 1221.9281 1251.3856 1281.1111 1301.4502 1330.7528 1379.7537 1389.4505 1407.7107 1464.0833 1473.9851 1484.0424 1493.2130 1568.9475 1595.2477 1603.1214 1641.7121 1644.6814 2199.4264 2961.9785 2979.2536 2983.6899 2989.4397 3072.0696 3077.9354 3087.1964 3092.4797 3506.8222 3517.3246 3660.9493 3673.5448
redmass: 7.5884 5.1546 6.1431 8.3278 5.4455 5.1298 4.8128 4.9232 1.1005 1.8109 1.4086 3.6576 3.3236 4.4863 4.1345 3.9484 4.7527 4.7543 1.2504 3.8408 1.3325 1.9983 4.2367 2.6980 3.1119 3.2880 1.6983 2.2939 3.5339 4.4293 4.5192 4.3868 3.7494 2.9384 1.4686 2.7030 2.1448 1.5096 2.7993 2.3615 1.9407 2.0651 1.7704 2.4127 2.1872 1.6285 1.8695 1.9387 1.6747 3.3122 4.2787 1.1882 1.2042 1.0493 1.0506 1.0547 1.0549 3.7171 1.7483 1.8899 2.8007 3.2768 12.5674 1.0803 1.0373 1.0385 1.0813 1.0984 1.0989 1.1002 1.0995 1.0454 1.0456 1.1039 1.1042
irintensity: 2.3756 5.6897 2.7830 3.3282 3.6259 2.0225 2.3104 7.8370 0.7336 1.2591 1.4799 1.3311 2.5642 2.1229 0.8254 1.5417 0.4400 4.4756 88.5521 0.2856 51.2583 93.8225 4.2062 63.6749 64.4590 35.6430 67.7588 52.8126 7.4393 35.8358 0.2632 1.0024 2.4808 2.3278 1.0838 2.2986 11.1981 1.5204 61.4255 33.7943 0.2804 9.6128 1.1685 14.9687 96.7363 29.8922 26.6815 67.7477 21.8527 196.4569 80.0920 20.7300 16.9157 6.4473 5.1336 8.6277 12.6638 427.9546 74.2945 286.2346 210.6030 255.2097 16.8484 11.5202 18.6205 13.2152 32.9180 8.9598 33.3179 10.8320 18.3462 50.3156 89.2356 28.2966 36.1122
temp: 298.150 k
press: 1.00000 atm
elementType: 8 8 7 7 7 7 6 6 6 6 6 6 6 6 6 1 1 1 1 1 1 1 1 1 1 1 1
symmnumber: 1
zpe: 548824.9 jmol-1
zpe.correction: 0.209036 hartree
zpe.thermalcorrener: 0.224231 hartree
zpe.thermalcorrenthalpy: 0.225175 hartree
zpe.thermalcorrgfe: 0.167275 hartree
zpe.sumelectzpe: -718.497706 hartree
zpe.sumelectthermal: -718.482512 hartree
zpe.sumelectthermalent: -718.481568 hartree
zpe.sumelectthermalfe: -718.539468 hartree
dipole: -11.7183 -2.6111 4.9684
dipole: 12.9931
quadrupole: -90.7208 -91.0277 -90.3932
quadrupole: -1.5167 -2.1149 -0.5030
quadrupole: -0.0069 -0.3138 0.3207 -1.5167 -2.1149 -0.5030
hfenergy: -718.7067426 hartree
pointgroup: C01 [X(C9H12N4O2)]
dipole: -4.6100119 1.3633773 -1.7378958 debye
polarizability: 168.1590394|-1.3073244|117.4181426|9.6542239|0.2562386|94.1140411 unknown
InChI: InChI=1S/C9H12N4O2/c1-9(2)4(3-10)8(15)13-6(11)5(9)7(12)14/h4-5H,11-12H2,1-2H3
charge 0 multiplicity 1
27 atoms
O  2.195986 -2.089246 0.201516
O  -1.62346 0.604028 1.834698
N  -0.103721 -2.028883 -0.151026
N  -2.360777 -1.960879 -0.63143
N  -3.153754 1.496252 0.338818
N  3.548578 1.174974 0.491497
C  0.217816 0.839548 -0.702346
C  -1.224529 0.230838 -0.575131
C  1.108004 0.121197 0.387524
C  0.186782 2.367624 -0.457743
C  0.770042 0.559141 -2.125282
C  -1.171385 -1.304093 -0.437485
C  1.137849 -1.419626 0.129508
C  -2.000779 0.791181 0.641789
C  2.461274 0.686536 0.448641
H  -1.77575 0.476732 -1.504804
H  0.610899 0.273635 1.369945
H  1.19151 2.796272 -0.613978
H  -0.504082 2.863488 -1.166057
H  -0.129091 2.615436 0.571007
H  1.814875 0.908539 -2.202018
H  0.756418 -0.515817 -2.378433
H  0.175895 1.102067 -2.883719
H  -2.369876 -2.973756 -0.504788
H  -3.231881 -1.465883 -0.810122
H  -3.690765 1.895212 1.110718
H  -3.413182 1.738986 -0.615998
