program: Gaussian 09
title: 000246849
version: EM64L-G09RevD.01
frameworkgroup: C1[X(C9H19BrO3)]
method: RPBEPBE
basis: SDD
operation: Freq
keyword: #p
keyword: freq=noraman
keyword: PBEPBE/SDD
title: #p freq=noraman PBEPBE/SDD
converged: YES YES NO NO
title: Mulliken charges:
elementType: Br O O O C C C C C C C C C H H H H H H H H H H H H H H H H H H H
charge: -0.027486 -0.260791 -0.261051 -0.291377 -0.542704 0.032692 -0.188388 -0.211207 -0.242212 -0.202555 -0.683520 -0.687667 -0.682410 0.324594 0.236756 0.215093 0.223150 0.203772 0.212961 0.243579 0.215882 0.197739 0.192198 0.205595 0.224301 0.236960 0.204488 0.222625 0.223478 0.207470 0.230594 0.227439
chargesum: 0.00000
title: Mulliken charges with hydrogens summed into heavy atoms:
elementType: Br O O O C C C C C C C C C
charge: -0.027486 -0.260791 -0.261051 -0.291377 -0.218110 0.269448 0.249855 0.205526 0.217250 0.187382 -0.016664 -0.037075 -0.016907
polarizability: 1.53856457e+02 1.41000394e+01 1.38085636e+02 -6.33551312e-01 -2.78253371e+00 9.30565733e+01
1716.lowfreq: -12.2072 -8.2572 0.0008 0.0009 0.0009 5.3010 13.3916 27.8812 37.2332
frequency: -2.8380 27.8125 37.1743 53.2792 58.4044 66.9042 93.7281 123.7094 145.4106 152.4131 168.8215 206.4138 218.8472 231.9040 243.6618 249.6950 255.1672 276.3705 339.3660 351.9504 420.1335 493.9833 509.3499 614.4946 699.7529 780.0893 811.6297 814.5834 816.8947 838.0716 846.1928 913.6073 952.6406 985.7366 1004.6484 1028.9068 1052.0572 1057.6557 1079.9641 1096.7402 1109.5080 1126.0181 1129.0069 1136.5555 1138.0659 1141.2829 1170.2188 1203.8190 1249.7600 1253.0032 1256.6008 1271.4172 1319.9820 1338.3550 1344.7323 1368.5011 1378.2090 1389.1440 1393.4035 1397.3827 1403.7295 1459.2258 1460.3302 1460.3889 1467.2213 1478.1730 1479.3226 1481.8197 1490.3391 1492.3378 1495.2312 2925.8066 2952.7373 2953.0391 2975.6938 2987.5985 2988.2465 2993.1301 2993.7995 2994.0997 3012.6956 3014.1012 3056.7349 3085.1810 3090.8013 3091.4422 3095.8387 3098.1818 3099.5635 3101.5439
redmass: 2.6061 3.7569 3.1043 2.6754 1.8134 2.3170 3.6621 2.4969 3.5423 2.8658 4.1184 2.7327 4.2749 1.4737 1.3200 1.6528 1.9914 3.5465 3.3487 3.4269 3.3271 3.7482 3.5482 5.3310 4.3144 3.1869 1.1084 1.0962 1.1052 2.6821 2.8459 2.0483 5.5475 3.9271 2.7515 2.9476 3.9069 3.5540 2.9907 2.3211 2.1223 1.9554 2.4057 1.4488 1.4541 1.5831 1.2436 1.2153 1.1497 1.1473 1.1501 1.2018 1.2030 1.2493 1.2206 1.2418 1.3185 1.2418 1.2659 1.3048 1.4051 1.0409 1.0413 1.0405 1.0822 1.0511 1.0508 1.0468 1.0797 1.0781 1.0847 1.0555 1.0568 1.0578 1.1064 1.0585 1.0608 1.0381 1.0553 1.0364 1.1055 1.1048 1.1051 1.0986 1.0992 1.0990 1.1012 1.0870 1.1009 1.1012
irintensity: 0.3591 0.2510 0.7837 1.1167 2.6733 1.6554 0.3382 1.2726 0.4745 13.9419 6.4154 1.7380 4.3201 0.3426 1.0240 0.8040 4.4120 6.9481 4.6828 8.6693 8.2117 15.4786 1.7923 21.1483 40.0860 3.9813 3.6768 5.7391 2.4728 9.5287 12.7817 40.2364 183.2975 30.5801 37.0538 96.7383 177.1752 119.3989 19.9608 14.0110 8.0853 10.2027 9.0694 3.2928 8.9635 10.5252 6.2893 0.2691 0.6256 0.3958 3.2640 4.4921 17.4180 35.2662 6.0735 1.2039 4.6590 11.0535 31.4529 20.4911 8.7203 9.3427 10.7285 11.9469 9.2880 6.7736 5.2794 2.3001 7.0714 8.6786 3.8502 61.2280 32.0025 59.6746 55.8263 38.2651 30.7378 15.9201 40.5872 21.7701 28.3386 34.8444 2.1208 33.5182 48.6251 33.7202 42.0181 7.9007 31.8093 35.0820
temp: 298.150 k
press: 1.00000 atm
elementType: 35 8 8 8 6 6 6 6 6 6 6 6 6 1 1 1 1 1 1 1 1 1 1 1 1 1 1 1 1 1 1 1
symmnumber: 1
zpe: 711248.6 jmol-1
zpe.correction: 0.270900 hartree
zpe.thermalcorrener: 0.287610 hartree
zpe.thermalcorrenthalpy: 0.288555 hartree
zpe.thermalcorrgfe: 0.224085 hartree
zpe.sumelectzpe: -592.353237 hartree
zpe.sumelectthermal: -592.336527 hartree
zpe.sumelectthermalent: -592.335583 hartree
zpe.sumelectthermalfe: -592.400053 hartree
dipole: 1.7428 1.4984 0.9908
dipole: 2.5029
quadrupole: -79.3233 -88.2930 -91.5492
quadrupole: -7.1844 -1.1548 -3.0306
quadrupole: 7.0652 -1.9045 -5.1607 -7.1844 -1.1548 -3.0306
hfenergy: -592.6241377 hartree
pointgroup: C01 [X(C9H19Br1O3)]
dipole: 0.2516699 -0.9515603 0.0289136 debye
polarizability: 136.8164918|-14.4259441|140.3977975|2.2053474|-25.8764303|107.7843768 unknown
InChI: InChI=1S/C9H19BrO3/c1-4-11-7-8(10)9(12-5-2)13-6-3/h8-9H,4-7H2,1-3H3
charge 0 multiplicity 1
32 atoms
Br -0.141059 3.035921 -1.681651
O  -2.020219 0.920903 -0.07272
O  -0.639579 -1.0193 -0.498988
O  2.251853 0.090467 -0.024414
C  0.272185 1.315362 -0.653907
C  -0.932805 0.368763 -0.850371
C  1.61218 0.763926 -1.162584
C  -3.351541 0.401382 -0.46247
C  -0.427968 -1.291318 0.951744
C  3.437273 -0.683205 -0.432476
C  -4.375761 1.034529 0.47649
C  -0.365588 -2.81088 1.097328
C  4.028954 -1.320352 0.823959
H  0.361419 1.642504 0.394094
H  -1.194564 0.3003 -1.926624
H  1.445299 0.049791 -1.997244
H  2.262213 1.58841 -1.518117
H  -3.546886 0.681745 -1.519369
H  -3.352865 -0.704504 -0.385997
H  0.518282 -0.817458 1.269275
H  -1.27048 -0.858995 1.524661
H  3.136384 -1.457155 -1.172259
H  4.173552 -0.00606 -0.920051
H  -5.395589 0.697725 0.215324
H  -4.171344 0.752376 1.523903
H  -4.338847 2.13479 0.401461
H  -0.212147 -3.086479 2.157174
H  -1.302003 -3.279035 0.746227
H  0.469451 -3.224662 0.505002
H  4.926095 -1.913008 0.568095
H  4.317751 -0.543797 1.552891
H  3.293252 -1.990189 1.302615
