program: Gaussian 09
title: 000246879
version: EM64L-G09RevD.01
frameworkgroup: C1[X(C22H36O)]
method: RPBEPBE
basis: SDD
operation: Freq
keyword: #pfreq=noraman
keyword: PBEPBE/SDD
title: #p freq=noraman PBEPBE/SDD
converged: YES YES NO NO
title: Mulliken charges:
elementType: O C C C C C C C C C C C C C C C C C C C C C C H H H H H H H H H H H H H H H H H H H H H H H H H H H H H H H H H H H H
charge: -0.471018 0.399155 -0.137655 -0.124335 -0.116415 0.247614 0.391798 -0.550282 -0.551545 -0.578459 -0.077411 -0.503307 -0.537823 -0.483126 -0.821851 -0.134520 -0.522500 -0.853835 -0.523147 -0.235402 -0.767638 -0.723951 -0.205668 0.224333 0.241374 0.178731 0.198770 0.219599 0.220045 0.220376 0.219143 0.222622 0.218847 0.214239 0.194716 0.220473 0.208687 0.192003 0.198743 0.211217 0.227565 0.250090 0.233192 0.218285 0.215008 0.218400 0.218706 0.241987 0.214129 0.207874 0.329528 0.195934 0.220849 0.225499 0.215098 0.215879 0.210703 0.218108 0.200569
chargesum: 0.00000
title: Mulliken charges with hydrogens summed into heavy atoms:
elementType: O C C C C C C C C C C C C C C C C C C C C C C
charge: -0.141490 0.399155 0.086678 0.117040 0.062316 0.247614 0.391798 -0.131912 -0.111125 -0.136694 0.141436 -0.094351 -0.108664 -0.092380 -0.132979 0.098672 -0.089207 -0.174742 -0.101145 -0.039468 -0.106192 -0.079260 -0.005098
polarizability: 2.77358152e+02 3.56381256e+00 2.12873113e+02 -3.70061832e-02 1.18617078e-01 1.89224340e+02
1716.lowfreq: -14.6280 -6.6320 -0.0005 -0.0003 0.0002 18.1495 38.2667 57.2432 90.8372
frequency: 38.2516 57.2376 90.8330 95.8996 118.6832 132.9276 140.6948 155.2136 183.6567 195.5709 211.8292 220.7722 224.1554 233.7366 236.9555 256.5460 265.4596 278.6244 295.6012 299.6109 311.9724 319.4329 342.4092 366.6179 377.5194 381.8540 398.8960 403.4237 408.7173 411.1100 440.2017 450.4944 464.6011 486.5406 502.8242 536.8971 539.3586 554.7554 566.3099 593.2582 628.2990 664.1081 684.3830 718.8829 763.8823 770.4344 801.9565 822.5354 837.1091 852.8105 871.4975 884.6468 904.5542 907.4297 909.4819 914.1870 930.9920 942.7586 946.6737 949.7336 960.2918 964.7003 973.3211 974.3217 983.7051 996.0934 1001.5972 1008.9543 1016.6053 1032.8075 1052.3708 1061.3384 1074.8280 1088.6181 1105.9442 1113.6634 1118.6511 1120.1550 1130.9578 1132.0490 1139.5652 1148.1337 1153.6975 1166.2684 1174.4514 1180.7768 1184.3274 1195.8764 1213.5528 1217.3649 1222.7834 1230.6928 1244.0862 1251.7513 1254.7740 1275.2043 1280.1932 1287.9290 1297.2186 1303.6265 1308.2356 1310.9867 1316.2940 1319.1503 1325.9502 1330.4783 1333.7863 1337.4288 1338.5358 1345.5543 1350.6223 1353.8587 1367.5282 1377.2751 1380.3133 1393.4179 1395.3846 1397.6258 1453.6342 1453.9404 1455.3566 1462.6522 1463.3230 1465.5162 1468.9712 1471.0470 1473.1318 1484.7426 1485.1638 1486.6584 1487.3395 1489.8556 1493.5532 1506.2764 1677.0046 2888.6175 2925.9098 2934.7774 2941.6233 2943.9157 2964.1656 2969.5653 2970.0480 2975.9278 2977.6302 2984.7294 2986.4763 2988.7289 2989.9355 2990.2049 2990.7884 2998.4226 3002.7618 3005.8394 3013.0045 3024.9120 3028.2329 3041.8661 3046.0500 3058.0798 3062.8761 3066.5147 3067.9334 3072.6653 3079.7156 3085.6680 3087.4454 3091.8981 3105.4954 3118.8421 3568.4371
redmass: 3.7373 3.2325 2.3259 2.6450 3.3328 3.0356 2.1247 2.1900 1.5724 1.4329 1.8033 1.5296 1.8809 2.1015 1.3946 1.8853 1.9020 2.0848 1.9683 2.0884 2.4697 2.6581 2.7015 2.3838 2.7926 2.4262 3.2206 2.3772 2.5111 2.8181 3.6900 3.6687 2.4207 2.6208 2.3758 2.8639 2.5525 2.8125 4.2230 2.6441 2.9187 1.2740 2.5208 2.7173 2.4335 2.0400 2.2382 2.1484 1.9229 2.1575 2.0454 2.1511 1.8050 2.5007 1.8357 1.2485 1.9808 1.8183 1.9279 1.7330 1.8535 1.9326 1.2873 2.2305 2.0706 2.0990 2.0002 1.9869 2.1146 1.6936 1.9671 1.9683 2.6700 2.2483 2.1718 2.5020 1.7124 2.3655 1.7853 1.8602 1.5644 2.1459 1.8810 1.7063 1.6660 1.4326 1.5562 1.6293 1.4997 1.5343 1.6522 1.6219 1.3828 1.4529 1.4309 1.4076 1.4505 1.5340 1.2694 1.4339 1.4404 1.4017 1.4011 1.6066 1.3363 1.4290 1.4690 1.4767 1.4678 1.4486 1.5940 1.4113 1.4495 1.5836 1.2150 1.2064 1.1947 1.1983 1.0745 1.0735 1.0933 1.0872 1.0653 1.0756 1.0707 1.0733 1.0689 1.0660 1.0583 1.0661 1.0648 1.0573 1.0618 1.0467 6.4174 1.0811 1.0808 1.0650 1.0637 1.0646 1.0606 1.0557 1.0568 1.0598 1.0385 1.0441 1.0746 1.0671 1.0691 1.0703 1.0946 1.0866 1.0549 1.0473 1.0962 1.0991 1.0997 1.1017 1.1012 1.0990 1.1012 1.1009 1.0976 1.0978 1.0985 1.0836 1.0971 1.0984 1.0988 1.0993 1.0654
irintensity: 0.0289 0.1339 0.0734 0.0851 0.0595 0.6609 0.1500 0.2967 0.0720 0.4379 0.3700 1.4628 0.0480 2.6086 0.1366 26.1400 38.5641 15.4673 25.3334 1.1374 5.2096 2.3027 0.5166 5.1621 7.6588 3.3487 1.7554 13.5497 1.4440 2.5229 0.1587 0.6343 5.5589 0.0872 2.7240 1.5372 0.3898 0.7126 7.4332 1.3378 1.9426 42.3481 5.3625 1.6833 5.7282 1.0774 0.3139 3.3603 7.1817 0.7052 1.7931 5.5051 0.9472 0.6446 3.6524 1.6071 4.2743 55.5069 7.7448 5.0928 8.9500 1.8705 1.3312 45.2125 2.0594 7.2209 0.4582 10.6470 1.3362 5.1351 7.8486 4.3053 5.6158 3.9316 2.7687 0.9789 7.7445 7.4966 1.6453 0.5903 4.0299 6.8933 2.1407 3.4086 6.6631 6.0901 2.6933 8.2362 7.5227 1.4820 7.5999 1.2330 0.9011 7.4185 3.9054 1.6351 0.1810 2.9229 6.1110 5.5884 4.8916 3.7737 3.2096 5.9240 0.9196 0.5529 1.6777 2.7489 0.9486 0.7725 0.1750 0.4600 5.8465 0.6251 17.4619 21.7042 51.9430 10.6027 7.6152 1.1722 0.9242 11.1216 7.4021 5.3021 8.2978 9.6780 7.0400 6.3436 3.8817 13.7165 0.6292 2.1320 8.5482 24.2811 6.7476 17.2759 7.7491 28.6556 37.6028 37.4851 60.9402 13.1311 24.3633 27.4057 19.1249 13.6436 28.2296 3.4618 36.4860 43.5717 21.5606 34.3153 44.2010 21.4740 62.8008 83.9613 23.0871 10.6466 60.9147 9.9893 38.5063 84.9521 48.4330 30.4755 36.6800 9.6316 40.8587 41.5477 21.4802 87.2901 1.7971
temp: 298.150 k
press: 1.00000 atm
elementType: 8 6 6 6 6 6 6 6 6 6 6 6 6 6 6 6 6 6 6 6 6 6 6 1 1 1 1 1 1 1 1 1 1 1 1 1 1 1 1 1 1 1 1 1 1 1 1 1 1 1 1 1 1 1 1 1 1 1 1
symmnumber: 1
zpe: 1395081.1 jmol-1
zpe.correction: 0.531358 hartree
zpe.thermalcorrener: 0.554262 hartree
zpe.thermalcorrenthalpy: 0.555206 hartree
zpe.thermalcorrgfe: 0.482952 hartree
zpe.sumelectzpe: -933.321289 hartree
zpe.sumelectthermal: -933.298385 hartree
zpe.sumelectthermalent: -933.297441 hartree
zpe.sumelectthermalfe: -933.369696 hartree
dipole: -0.8333 0.9050 -1.4440
dipole: 1.8970
quadrupole: -138.4922 -142.9502 -146.7133
quadrupole: -1.7494 4.7332 2.2090
quadrupole: 4.2263 -0.2316 -3.9948 -1.7494 4.7332 2.2090
hfenergy: -933.8526475 hartree
pointgroup: C01 [X(C22H36O1)]
dipole: -0.3155488 0.4268767 -0.5246281 debye
polarizability: 277.2391932|3.7254528|212.4572297|2.8009808|3.3278436|189.7591816 unknown
InChI: InChI=1S/C22H36O/c1-15(2)22(23)14-11-19-17-9-8-16-7-5-6-12-20(16,3)18(17)10-13-21(19,22)4/h5-6,15-19,23H,7-14H2,1-4H3
charge 0 multiplicity 1
59 atoms
O  -4.249941 -0.843319 1.154342
C  -1.895781 -0.415246 0.589825
C  -1.151331 0.862474 0.086351
C  0.343568 0.900779 0.472376
C  1.044012 -0.373682 -0.108532
C  -3.395616 -0.113089 0.176539
C  2.591593 -0.411126 0.190856
C  -1.217935 -1.658235 -0.036759
C  0.302969 -1.68533 0.283831
C  -2.07453 2.027105 0.52198
C  3.227673 0.914982 -0.363143
C  1.027663 2.183276 -0.059999
C  -3.520618 1.446909 0.375357
C  2.547364 2.182023 0.203535
C  -1.837576 -0.530927 2.143185
C  -3.848968 -0.600421 -1.254559
C  3.241854 -1.604366 -0.580884
C  2.88737 -0.581194 1.706856
C  4.761069 0.961657 -0.156276
C  4.747588 -1.489683 -0.73787
C  -5.384371 -0.440819 -1.442072
C  -3.138975 0.063161 -2.462821
C  5.43957 -0.337737 -0.537036
H  -1.1656 0.838792 -1.022951
H  0.433835 0.898382 1.578163
H  0.956531 -0.279552 -1.219005
H  -1.341144 -1.648944 -1.137303
H  -1.692861 -2.587984 0.334082
H  0.444096 -1.891771 1.361135
H  0.757608 -2.537996 -0.255822
H  -1.929045 2.930063 -0.097578
H  -1.867761 2.314296 1.570369
H  3.044501 0.904325 -1.461729
H  0.562911 3.077351 0.399784
H  0.846039 2.25636 -1.154493
H  -4.118998 1.645737 1.283512
H  -4.049122 1.9203 -0.471955
H  3.012927 3.080556 -0.250427
H  2.73752 2.25153 1.294335
H  -0.797394 -0.568079 2.506098
H  -2.341249 0.314778 2.64092
H  -2.35589 -1.446972 2.468307
H  -3.633568 -1.687758 -1.285403
H  2.776085 -1.692272 -1.587885
H  3.010053 -2.556576 -0.062654
H  2.521724 0.272204 2.304738
H  2.408675 -1.4948 2.102889
H  3.973147 -0.681171 1.883067
H  4.992799 1.214146 0.901908
H  5.18429 1.794567 -0.755173
H  -5.188931 -0.566751 1.009102
H  5.286917 -2.402232 -1.030492
H  -5.71257 0.606306 -1.292073
H  -5.669704 -0.726577 -2.470826
H  -5.962504 -1.095086 -0.763884
H  -3.244152 1.164419 -2.449242
H  -3.596456 -0.299692 -3.402479
H  -2.063797 -0.175721 -2.51202
H  6.532738 -0.329367 -0.651698
